{"text_format":"3","workbook":"xlsx","n_sheets":4,"sheets":["Sheet1","Sheet4","Sheet6","Sheet5"],"not_rendered":{"external_links":1,"defined_names":1,"comments":1},"read":"whole","date_system":"1900"}

{"sheet":"Sheet1","index":0,"n_rows":1,"n_cols":9,"rows_kept":1}
["Month","JOB_NO","PROJECT_JOB_TYPE","BUDGET_ORG","Budget_CHK","ACTUAL","Commit_PO","Commit_SSR","Cost_To_CMPT"]

{"sheet":"Sheet4","index":1,"n_rows":163,"n_cols":41,"rows_kept":163,"hidden":true,"merged":[[0,0,0,38],[1,0,2,0],[1,1,2,1],[1,2,2,2],[1,3,2,3],[1,4,2,4],[1,5,2,5],[1,6,2,6],[1,7,2,7],[1,8,1,25],[1,26,2,26],[1,27,2,27],[1,28,2,28],[1,29,2,29],[1,30,1,31],[1,32,2,32],[1,33,2,33],[1,34,2,34],[1,35,1,36],[1,37,1,38],[1,39,1,40]]}
["Cost Overview for Projects"]
["B.U.","Job","Project Title","Job\nStatus","Lead\nBy","P.M.","C.M.","Approval\nDate","Hiden Information",{"$nulls":17},"Approved\nBudget\n1","Estimated\nFinal Cost\n5=2+3+4","Devi.(%)\n\n(5-1)/1","Actual\n\n2","Committed\n3",null,"Cost to\ncomplete\n4","Devi.(%)\n_POPR","Devi.(%)\n_SSR","Internal\nEngineering Cost",null,"Internal Const.Supervsn Cost",null,"Wrong Booking Indicator"]
[{"$nulls":8},"M.C.Date","TCCC Date","Business\nClosure Date","Priority","WBS\nAccount","Netowrk","Actual Cost\nMigrated?","Job No.","Original\nBudget","Budget\nChange","Final\ncost","Actual\ncost","Commitment","Rem.M.H\n(Eng)","Rem.M.H\n(Con.Sup)","Budget(used to calculate C2C)","Cost to\ncomplete","Saved\nCost",{"$nulls":4},"PR/PO","SSR",{"$nulls":3},"Rem M.H.\n/RMB","Compl\n(%)","Rem M.H.\n/RMB","Compl\n(%)","Material","SSR"]
["CBP/C",15292,"Modification of the Furnace Burners","On Going","CTE/P","Ding Juntao",0,"2015-12-31","00:00:00","00:00:00","00:00:00","N","ZNIC.011312","NZNIC015292K",null,15292,0,{"v":0,"d":"0 "},{"v":0,"d":"0 "},{"v":0,"d":"0 "},{"v":195339.88,"d":"195,340 "},{"v":90000,"d":"90,000 "},0,0,{"v":-285339.88,"d":"-285,340"},0,0,{"v":-90000,"d":"-90,000"},{"$error":"#DIV/0!"},0,{"v":195339.88,"d":"195,340"},0,{"v":-285339.88,"d":"-285,340"},{"$error":"#DIV/0!"},{"$error":"#DIV/0!"},{"v":90000,"d":"90,000"},{"v":0,"d":"0.00%"},0,{"$error":"#DIV/0!"},0,0]
["CEP/L",15278,"Upgrade the HIPS Palletizer","On Going","CTE/P","Zhou Yanduo","Wu Zefei","2015-12-30","00:00:00","00:00:00","00:00:00","N","ZNIC.011307","NZNIC015278K",null,15278,{"v":1826000,"d":"1,826,000"},{"v":0,"d":"0 "},{"v":0,"d":"0 "},{"v":0,"d":"0 "},{"v":0,"d":"0 "},{"v":117000,"d":"117,000 "},{"v":97000,"d":"97,000"},{"v":1826000,"d":"1,826,000"},{"v":1612000,"d":"1,612,000"},0,{"v":1826000,"d":"1,826,000"},{"v":1612000,"d":"1,612,000"},{"v":-0.1171960569550931,"d":"-11.72%"},0,0,0,{"v":1612000,"d":"1,612,000"},{"$error":"#DIV/0!"},{"$error":"#DIV/0!"},{"v":117000,"d":"117,000"},{"v":0,"d":"0.00%"},{"v":97000,"d":"97,000"},{"v":0,"d":"0.00%"},0,0]
["CTE",15277,"Add New Road Lamps at 5# Gate and ChengPin Road","On Going","CTE/A","Bian Jiacai","Sun Zhongpin","2015-12-22","00:00:00","00:00:00","00:00:00","N","ZNIF.623100.15.01","NZNIC015277K",null,15277,{"v":538000,"d":"538,000"},{"v":0,"d":"0 "},{"v":16500,"d":"16,500 "},{"v":14300,"d":"14,300 "},{"v":1110376.9,"d":"1,110,377 "},{"v":0,"d":"0 "},0,{"v":538000,"d":"538,000"},{"v":-586676.8999999999,"d":"-586,677"},0,{"v":538000,"d":"538,000"},{"v":538000,"d":"538,000"},{"v":0,"d":"0.00%"},{"v":14300,"d":"14,300"},{"v":1110376.9,"d":"1,110,377"},0,{"v":-586676.8999999999,"d":"-586,677"},{"$error":"#DIV/0!"},{"$error":"#DIV/0!"},0,{"$error":"#DIV/0!"},0,{"$error":"#DIV/0!"},0,0]
["CBP/U",15267,"Add a Pressure Control valve on CR Line","On Going","CTE/P","Yu Xiya","Jiang Haijing","2015-12-18","00:00:00","00:00:00","00:00:00","N","ZNIF.623350.15.01","NZNIC015267K",null,15267,{"v":676000,"d":"676,000"},{"v":0,"d":"0 "},{"v":0,"d":"0 "},{"v":0,"d":"0 "},{"v":1454957.27,"d":"1,454,957 "},{"v":90000,"d":"90,000 "},{"v":110000,"d":"110,000"},{"v":676000,"d":"676,000"},{"v":-978957.27,"d":"-978,957"},0,{"v":676000,"d":"676,000"},{"v":476000,"d":"476,000"},{"v":-0.2958579881656805,"d":"-29.59%"},0,{"v":1454957.27,"d":"1,454,957"},0,{"v":-978957.27,"d":"-978,957"},{"$error":"#DIV/0!"},{"$error":"#DIV/0!"},{"v":90000,"d":"90,000"},{"v":0,"d":"0.00%"},{"v":110000,"d":"110,000"},{"v":0,"d":"0.00%"},0,0]
["CBP/U",15263,"Adding Monitoring System for YBS Utility","Completed","CTE/A","Hu Xiao","Sun Zhongpin","2015-11-20","2015-12-31","00:00:00","00:00:00","H","ZNIF.620051.15.01","NZNIC015263K",null,15263,{"v":478000,"d":"478,000"},{"v":0,"d":"0 "},{"v":770390,"d":"770,390 "},{"v":0,"d":"0 "},{"v":746000,"d":"746,000 "},{"v":0,"d":"0 "},0,{"v":478000,"d":"478,000"},{"v":-479936.9,"d":"-479,937"},{"v":81646.9,"d":"81,647"},{"v":478000,"d":"478,000"},{"v":396353.1,"d":"396,353"},{"v":-0.17080941422594148,"d":"-17.08%"},0,{"v":746000,"d":"746,000"},{"v":130290,"d":"130,290"},{"v":-479936.9,"d":"-479,937"},{"v":-0.40935909129560727,"d":"-40.94%"},{"$error":"#DIV/0!"},0,{"$error":"#DIV/0!"},0,{"$error":"#DIV/0!"},0,0]
["COA/A",15256,"Add One Common Spare Motor for GAA Molten Salt Pumps","On Going","CTA/L","Zhu Qiang","N/A","2015-10-20","00:00:00","00:00:00","00:00:00","N","ZNIC.010728","NZNIC015256K",null,15256,{"v":2750000,"d":"2,750,000"},{"v":0,"d":"0 "},{"v":2750000,"d":"2,750,000 "},{"v":0,"d":"0 "},{"v":0,"d":"0 "},{"v":6000,"d":"6,000 "},0,{"v":2750000,"d":"2,750,000"},{"v":2744000,"d":"2,744,000"},0,{"v":2750000,"d":"2,750,000"},{"v":2744000,"d":"2,744,000"},{"v":-0.002181818181818182,"d":"-0.22%"},0,0,0,{"v":2744000,"d":"2,744,000"},{"$error":"#DIV/0!"},{"$error":"#DIV/0!"},{"v":6000,"d":"6,000"},{"v":0,"d":"0.00%"},0,{"$error":"#DIV/0!"},0,0]
["COA/A",15247,"B450/B550 MCC Modification","On Going","CTA/L","Yi Yongjun","Sun Zhongpin","2015-10-08","00:00:00","00:00:00","00:00:00","H","ZNIC.010582","NZNIC015247K",null,15247,{"v":3500000,"d":"3,500,000"},{"v":0,"d":"0 "},{"v":4610377,"d":"4,610,377 "},{"v":0,"d":"0 "},{"v":120980,"d":"120,980 "},{"v":109450,"d":"109,450 "},{"v":177250,"d":"177,250"},{"v":3500000,"d":"3,500,000"},{"v":2565096.9000000004,"d":"2,565,097"},{"v":527223.0999999999,"d":"527,223"},{"v":3500000,"d":"3,500,000"},{"v":2686076.9000000004,"d":"2,686,077"},{"v":-0.23254945714285705,"d":"-23.25%"},0,{"v":120980,"d":"120,980"},0,{"v":2565096.9000000004,"d":"2,565,097"},{"v":-0.3219486443575964,"d":"-32.19%"},{"$error":"#DIV/0!"},{"v":109450,"d":"109,450"},{"v":0.17083333333333334,"d":"17.08%"},{"v":177250,"d":"177,250"},{"v":0.015277777777777777,"d":"1.53%"},0,0]
["COA/E",15246,"C7100,C77100,C77400 Raplace the Boken Trays","On Going","CTM/A","Ling Wenqing","Shi Jinsong","2015-09-17","00:00:00","00:00:00","00:00:00","N","ZNIC.010345","NZNIC015246K",null,15246,{"v":2687000,"d":"2,687,000"},{"v":0,"d":"0 "},{"v":4141957,"d":"4,141,957 "},{"v":4675,"d":"4,675 "},{"v":0,"d":"0 "},{"v":0,"d":"0 "},0,{"v":2687000,"d":"2,687,000"},{"v":2384625.01,"d":"2,384,625"},{"v":297699.99,"d":"297,700"},{"v":2687000,"d":"2,687,000"},{"v":2389300.01,"d":"2,389,300"},{"v":-0.11079270189802762,"d":"-11.08%"},{"v":4675,"d":"4,675"},0,0,{"v":2384625.01,"d":"2,384,625"},{"v":-0.14884999499999998,"d":"-14.88%"},{"$error":"#DIV/0!"},0,{"$error":"#DIV/0!"},0,{"$error":"#DIV/0!"},0,0]
["COO/A",15245,"Install Filters on the Bottom Discharge Lines of C2300 and C2500","On Going","CTE/P","Zhang Bianlin","Jiang Haijin","2015-12-01","00:00:00","00:00:00","00:00:00","N","ZNIC.011107","NZNIC015245K",null,15245,{"v":1252000,"d":"1,252,000"},{"v":0,"d":"0 "},{"v":1998000,"d":"1,998,000 "},{"v":26282.42,"d":"26,282 "},{"v":15811.97,"d":"15,812 "},{"v":165600,"d":"165,600 "},{"v":130000,"d":"130,000"},{"v":1252000,"d":"1,252,000"},{"v":831728.56,"d":"831,729"},{"v":82577.04999999999,"d":"82,577"},{"v":1252000,"d":"1,252,000"},{"v":873822.9500000001,"d":"873,823"},{"v":-0.30205834664536735,"d":"-30.21%"},{"v":26282.42,"d":"26,282"},{"v":15811.97,"d":"15,812"},0,{"v":831728.56,"d":"831,729"},{"v":-0.2866521646083706,"d":"-28.67%"},{"$error":"#DIV/0!"},{"v":165600,"d":"165,600"},{"v":0.02588235294117647,"d":"2.59%"},{"v":130000,"d":"130,000"},{"v":0,"d":"0.00%"},0,0]
["CEP/S",15242,"Relocation the Cable of PS Plant","On Going","CTE/A","Bian Jiacai","Sun Zhongpin","2015-11-26","00:00:00","00:00:00","00:00:00","N","ZNIC.011082","NZNIC015242K",null,15242,{"v":3196000,"d":"3,196,000"},{"v":0,"d":"0 "},{"v":3196000,"d":"3,196,000 "},{"v":0,"d":"0 "},{"v":1560000,"d":"1,560,000 "},{"v":326670,"d":"326,670 "},{"v":198000,"d":"198,000"},{"v":3196000,"d":"3,196,000"},{"v":1111330,"d":"1,111,330"},0,{"v":3196000,"d":"3,196,000"},{"v":2671330,"d":"2,671,330"},{"v":-0.1641645807259074,"d":"-16.42%"},0,{"v":1560000,"d":"1,560,000"},0,{"v":1111330,"d":"1,111,330"},{"$error":"#DIV/0!"},{"$error":"#DIV/0!"},{"v":326670,"d":"326,670"},{"v":0.027767857142857143,"d":"2.78%"},{"v":198000,"d":"198,000"},{"v":0,"d":"0.00%"},0,0]
["CBP/B",15198,"Install two CCTVs in BD Plant","On Going","CTE/A","Hu Xiao","Chen Gang","2015-10-28","00:00:00","00:00:00","00:00:00","N","ZNIF.104500.15.03","NZNIC015198K",null,15198,{"v":217000,"d":"217,000"},{"v":0,"d":"0 "},{"v":337980,"d":"337,980 "},{"v":82419.39,"d":"82,419 "},{"v":0,"d":"0 "},{"v":0,"d":"0 "},0,{"v":217000,"d":"217,000"},{"v":132210.63,"d":"132,211"},{"v":2369.979999999996,"d":"2,370"},{"v":217000,"d":"217,000"},{"v":214630.02000000002,"d":"214,630"},{"v":-0.010921566820276412,"d":"-1.09%"},{"v":82419.39,"d":"82,419"},0,0,{"v":132210.63,"d":"132,211"},{"v":-0.019362581699346373,"d":"-1.94%"},{"$error":"#DIV/0!"},0,{"$error":"#DIV/0!"},0,{"$error":"#DIV/0!"},0,0]
["COO/C",15197,"Revamping of C1 Flare KO Drums","On Going","CTE/P","Li Shouqing","Jiang Haijin","2015-12-29","00:00:00","00:00:00","00:00:00","N","ZNIC.011291","NZNIC015197K",null,15197,{"v":1340000,"d":"1,340,000"},{"v":0,"d":"0 "},{"v":0,"d":"0 "},{"v":0,"d":"0 "},{"v":4201.71,"d":"4,202 "},{"v":231550,"d":"231,550 "},{"v":268125,"d":"268,125"},{"v":1340000,"d":"1,340,000"},{"v":836123.29,"d":"836,123"},0,{"v":1340000,"d":"1,340,000"},{"v":840325,"d":"840,325"},{"v":-0.3728917910447761,"d":"-37.29%"},0,{"v":4201.71,"d":"4,202"},0,{"v":836123.29,"d":"836,123"},{"$error":"#DIV/0!"},{"$error":"#DIV/0!"},{"v":231550,"d":"231,550"},{"v":0,"d":"0.00%"},{"v":268125,"d":"268,125"},{"v":0,"d":"0.00%"},0,0]
{"$rows_left_out":149}
{"sheet":"Sheet6","index":2,"n_rows":163,"n_cols":41,"rows_kept":163,"hidden":true}
["Cost Overview for Projects"]
["B.U.","Job","Project Title","Job\nStatus","Lead\nBy","P.M.","C.M.","Approval\nDate","Hiden Information",{"$nulls":17},"Approved\nBudget\n1","Estimated\nFinal Cost\n5=2+3+4","Devi.(%)\n\n(5-1)/1","Actual\n\n2","Committed\n3",null,"Cost to\ncomplete\n4","Devi.(%)\n_POPR","Devi.(%)\n_SSR","Internal\nEngineering Cost",null,"Internal Const.Supervsn Cost",null,"Wrong Booking Indicator"]
[{"$nulls":8},"M.C.Date","TCCC Date","Business\nClosure Date","Priority","WBS\nAccount","Netowrk","Actual Cost\nMigrated?","Job No.","Original\nBudget","Budget\nChange","Final\ncost","Actual\ncost","Commitment","Rem.M.H\n(Eng)","Rem.M.H\n(Con.Sup)","Budget(used to calculate C2C)","Cost to\ncomplete","Saved\nCost",{"$nulls":4},"PR/PO","SSR",{"$nulls":3},"Rem M.H.\n/RMB","Compl\n(%)","Rem M.H.\n/RMB","Compl\n(%)","Material","SSR"]
["CBP/C",15292,"Modification of the Furnace Burners","On Going","CTE/P","Ding Juntao",0,42369,0,0,0,"N","ZNIC.011312","NZNIC015292K",null,15292,0,0,0,0,2560000,90000,0,0,-2650000,0,0,-90000,{"$error":"#DIV/0!"},0,2560000,0,-2650000,{"$error":"#DIV/0!"},{"$error":"#DIV/0!"},90000,0,0,{"$error":"#DIV/0!"},0,0]
["CEP/L",15278,"Upgrade the HIPS Palletizer","On Going","CTE/P","Zhou Yanduo","Wu Zefei",42368,0,0,0,"N","ZNIC.011307","NZNIC015278K",null,15278,1826000,0,0,0,1300000,117000,97000,1826000,312000,0,1826000,1612000,-0.1171960569550931,0,1300000,0,312000,{"$error":"#DIV/0!"},{"$error":"#DIV/0!"},117000,0,97000,0,0,0]
["CTE",15277,"Add New Road Lamps at 5# Gate and ChengPin Road","On Going","CTE/A","Bian Jiacai","Sun Zhongpin",42360,0,0,0,"N","ZNIF.623100.15.01","NZNIC015277K",null,15277,538000,0,16500,0,0,0,0,538000,538000,0,538000,538000,0,0,0,0,538000,{"$error":"#DIV/0!"},{"$error":"#DIV/0!"},0,{"$error":"#DIV/0!"},0,{"$error":"#DIV/0!"},0,0]
["CBP/U",15267,"Add a Pressure Control valve on CR Line","On Going","CTE/P","Yu Xiya","Jiang Haijing",42356,0,0,0,"N","ZNIF.623350.15.01","NZNIC015267K",null,15267,676000,0,0,0,0,90000,110000,676000,476000,0,676000,476000,-0.2958579881656805,0,0,0,476000,{"$error":"#DIV/0!"},{"$error":"#DIV/0!"},90000,0,110000,0,0,0]
["CBP/U",15263,"Adding Monitoring System for YBS Utility","Completed","CTE/A","Hu Xiao","Sun Zhongpin",42328,42369,0,0,"H","ZNIF.620051.15.01","NZNIC015263K",null,15263,478000,0,770390,14152.7,86534.19,0,0,478000,165376.21,81646.9,478000,396353.1,-0.17080941422594148,14152.7,86534.19,130290,165376.21,-0.40935909129560727,{"$error":"#DIV/0!"},0,{"$error":"#DIV/0!"},0,{"$error":"#DIV/0!"},0,0]
["COA/A",15256,"Add One Common Spare Motor for GAA Molten Salt Pumps","On Going","CTA/L","Zhu Qiang","N/A",42297,0,0,0,"N","ZNIC.010728","NZNIC015256K",null,15256,2750000,0,2750000,0,0,6000,0,2750000,2744000,0,2750000,2744000,-0.002181818181818182,0,0,0,2744000,{"$error":"#DIV/0!"},{"$error":"#DIV/0!"},6000,0,0,{"$error":"#DIV/0!"},0,0]
["COA/A",15247,"B450/B550 MCC Modification","On Going","CTA/L","Yi Yongjun","Sun Zhongpin",42285,0,0,0,"H","ZNIC.010582","NZNIC015247K",null,15247,3500000,0,4610377,25300,1110376.9,109450,177250,3500000,1550400.0000000002,527223.0999999999,3500000,2686076.9000000004,-0.23254945714285705,25300,1110376.9,0,1550400.0000000002,-0.3219486443575964,{"$error":"#DIV/0!"},109450,0.17083333333333334,177250,0.015277777777777777,0,0]
["COA/E",15246,"C7100,C77100,C77400 Raplace the Boken Trays","On Going","CTM/A","Ling Wenqing","Shi Jinsong",42264,0,0,0,"N","ZNIC.010345","NZNIC015246K",null,15246,2687000,0,4141957,0,1454957.27,0,0,2687000,934342.74,297699.99,2687000,2389300.01,-0.11079270189802762,0,1454957.27,0,934342.74,-0.14884999499999998,{"$error":"#DIV/0!"},0,{"$error":"#DIV/0!"},0,{"$error":"#DIV/0!"},0,0]
["COO/A",15245,"Install Filters on the Bottom Discharge Lines of C2300 and C2500","On Going","CTE/P","Zhang Bianlin","Jiang Haijin",42339,0,0,0,"N","ZNIC.011107","NZNIC015245K",null,15245,1252000,0,1998000,4400,669959.87,165600,130000,1252000,199463.08000000002,82577.04999999999,1252000,873822.95,-0.30205834664536746,4400,669959.87,0,199463.08000000002,-0.2866521646083706,{"$error":"#DIV/0!"},165600,0.02588235294117647,130000,0,0,0]
["CEP/S",15242,"Relocation the Cable of PS Plant","On Going","CTE/A","Bian Jiacai","Sun Zhongpin",42334,0,0,0,"N","ZNIC.011082","NZNIC015242K",null,15242,3196000,0,3196000,9330,800000,326670,198000,3196000,1862000,0,3196000,2671330,-0.1641645807259074,9330,800000,0,1862000,{"$error":"#DIV/0!"},{"$error":"#DIV/0!"},326670,0.027767857142857143,198000,0,0,0]
["CBP/B",15198,"Install two CCTVs in BD Plant","On Going","CTE/A","Hu Xiao","Chen Gang",42305,0,0,0,"N","ZNIF.104500.15.03","NZNIC015198K",null,15198,217000,0,337980,762.24,105748.42,0,0,217000,108119.36000000002,2369.979999999996,217000,214630.02000000002,-0.010921566820276412,762.24,105748.42,0,108119.36000000002,-0.019362581699346373,{"$error":"#DIV/0!"},0,{"$error":"#DIV/0!"},0,{"$error":"#DIV/0!"},0,0]
["COO/C",15197,"Revamping of C1 Flare KO Drums","On Going","CTE/P","Li Shouqing","Jiang Haijin",42367,0,0,0,"N","ZNIC.011291","NZNIC015197K",null,15197,1340000,0,0,0,115000,231550,268125,1340000,725325,0,1340000,840325,-0.3728917910447761,0,115000,0,725325,{"$error":"#DIV/0!"},{"$error":"#DIV/0!"},231550,0,268125,0,0,0]
{"$rows_left_out":149}
{"sheet":"Sheet5","index":3,"n_rows":142,"n_cols":14,"rows_kept":142,"hidden":true,"merged":[[0,0,0,13]]}
["Cost Report for MOC"]
["BU. ","Job No","Job Type","Job Title","Account","PM","MC","Budget","Planned","Actual","Cost to Com","Estiamted Final Cost","COST_COMPLE%","Remarks"]
[{"$f":"VLOOKUP(B3,[1]Eproject!$A:$B,2,FALSE)","v":"CBP/P"},15313,{"$f":"VLOOKUP(B3,[1]Eproject!$A:$C,3,FALSE)","v":"MOC"},{"$f":"VLOOKUP(B3,[1]Eproject!$A:$E,5,FALSE)","v":"Protection Relay of U4PM6101A Replacement for Updating"},{"$f":"VLOOKUP(B3,[1]Eproject!$A:$U,21,FALSE)","v":"973434426"},{"$f":"VLOOKUP(B3,[1]Eproject!$A:$J,10,FALSE)","v":"Ge Yong"},{"$f":"VLOOKUP(B3,[1]Eproject!$A:$P,16,FALSE)","v":"00:00:00"},{"$f":"VLOOKUP(E3,'[1]actual cost'!$F:$G,2,FALSE)","v":{"$error":"#N/A"}},{"$f":"VLOOKUP(E3,'[1]actual cost'!$F:$H,3,FALSE)","v":{"$error":"#N/A"}},{"$f":"VLOOKUP(E3,'[1]actual cost'!$F:$I,4,FALSE)","v":{"$error":"#N/A"}},{"$f":"IF(J3>I3,0,I3-J3)","v":{"$error":"#N/A"}},{"$f":"J3+K3","v":{"$error":"#N/A"}},{"$f":"J3/H3","v":{"$error":"#N/A"}}]
[{"$f":"VLOOKUP(B4,[1]Eproject!$A:$B,2,FALSE)","v":"COA/A"},15309,{"$f":"VLOOKUP(B4,[1]Eproject!$A:$C,3,FALSE)","v":"MOC"},{"$f":"VLOOKUP(B4,[1]Eproject!$A:$E,5,FALSE)","v":"Add Filter on Inlet of F430"},{"$f":"VLOOKUP(B4,[1]Eproject!$A:$U,21,FALSE)","v":"973506548"},{"$f":"VLOOKUP(B4,[1]Eproject!$A:$J,10,FALSE)","v":"Meng Yousheng"},{"$f":"VLOOKUP(B4,[1]Eproject!$A:$P,16,FALSE)","v":"2015-12-10"},{"$f":"VLOOKUP(E4,'[1]actual cost'!$F:$G,2,FALSE)","v":{"$error":"#N/A"}},{"$f":"VLOOKUP(E4,'[1]actual cost'!$F:$H,3,FALSE)","v":{"$error":"#N/A"}},{"$f":"VLOOKUP(E4,'[1]actual cost'!$F:$I,4,FALSE)","v":{"$error":"#N/A"}},{"$f":"IF(J4>I4,0,I4-J4)","v":{"$error":"#N/A"}},{"$f":"J4+K4","v":{"$error":"#N/A"}},{"$f":"J4/H4","v":{"$error":"#N/A"}}]
[{"$f":"VLOOKUP(B5,[1]Eproject!$A:$B,2,FALSE)","v":"CEP/E"},15307,{"$f":"VLOOKUP(B5,[1]Eproject!$A:$C,3,FALSE)","v":"MOC"},{"$f":"VLOOKUP(B5,[1]Eproject!$A:$E,5,FALSE)","v":"Add Tie-in for Chiller U3777"},{"$f":"VLOOKUP(B5,[1]Eproject!$A:$U,21,FALSE)","v":"973507320"},{"$f":"VLOOKUP(B5,[1]Eproject!$A:$J,10,FALSE)","v":"Wang Zhigao"},{"$f":"VLOOKUP(B5,[1]Eproject!$A:$P,16,FALSE)","v":"00:00:00"},{"$f":"VLOOKUP(E5,'[1]actual cost'!$F:$G,2,FALSE)","v":{"v":33800,"d":"33,800 "}},{"$f":"VLOOKUP(E5,'[1]actual cost'!$F:$H,3,FALSE)","v":{"v":23800,"d":"23,800 "}},{"$f":"VLOOKUP(E5,'[1]actual cost'!$F:$I,4,FALSE)","v":{"v":17020,"d":"17,020 "}},{"v":6780,"d":"6,780"},{"v":23800,"d":"23,800 "},{"v":0.5035502958579882,"d":"50.36%"}]
[{"$f":"VLOOKUP(B6,[1]Eproject!$A:$B,2,FALSE)","v":"CEP/E"},15304,{"$f":"VLOOKUP(B6,[1]Eproject!$A:$C,3,FALSE)","v":"MOC"},{"$f":"VLOOKUP(B6,[1]Eproject!$A:$E,5,FALSE)","v":"Add a Filter at Outlet of P5311"},{"$f":"VLOOKUP(B6,[1]Eproject!$A:$U,21,FALSE)","v":"973507099"},{"$f":"VLOOKUP(B6,[1]Eproject!$A:$J,10,FALSE)","v":"Li Jun"},{"$f":"VLOOKUP(B6,[1]Eproject!$A:$P,16,FALSE)","v":"00:00:00"},{"$f":"VLOOKUP(E6,'[1]actual cost'!$F:$G,2,FALSE)","v":{"v":23800,"d":"23,800 "}},{"$f":"VLOOKUP(E6,'[1]actual cost'!$F:$H,3,FALSE)","v":{"v":23800,"d":"23,800 "}},{"$f":"VLOOKUP(E6,'[1]actual cost'!$F:$I,4,FALSE)","v":{"v":7200,"d":"7,200 "}},{"v":16600,"d":"16,600"},{"v":23800,"d":"23,800 "},{"v":0.3025210084033613,"d":"30.25%"}]
[{"$f":"VLOOKUP(B7,[1]Eproject!$A:$B,2,FALSE)","v":"CBP/B"},15303,{"$f":"VLOOKUP(B7,[1]Eproject!$A:$C,3,FALSE)","v":"MOC"},{"$f":"VLOOKUP(B7,[1]Eproject!$A:$E,5,FALSE)","v":"Connect the Original and New Fuel Oil Line in BD"},{"$f":"VLOOKUP(B7,[1]Eproject!$A:$U,21,FALSE)","v":"973519560"},{"$f":"VLOOKUP(B7,[1]Eproject!$A:$J,10,FALSE)","v":"Wang Can"},{"$f":"VLOOKUP(B7,[1]Eproject!$A:$P,16,FALSE)","v":"00:00:00"},{"$f":"VLOOKUP(E7,'[1]actual cost'!$F:$G,2,FALSE)","v":{"$error":"#N/A"}},{"$f":"VLOOKUP(E7,'[1]actual cost'!$F:$H,3,FALSE)","v":{"$error":"#N/A"}},{"$f":"VLOOKUP(E7,'[1]actual cost'!$F:$I,4,FALSE)","v":{"$error":"#N/A"}},{"$error":"#N/A"},{"$error":"#N/A"},{"$error":"#N/A"}]
[{"$f":"VLOOKUP(B8,[1]Eproject!$A:$B,2,FALSE)","v":"CEP/E"},15302,{"$f":"VLOOKUP(B8,[1]Eproject!$A:$C,3,FALSE)","v":"MOC"},{"$f":"VLOOKUP(B8,[1]Eproject!$A:$E,5,FALSE)","v":"Add a Spring Hanger to T13017-1"},{"$f":"VLOOKUP(B8,[1]Eproject!$A:$U,21,FALSE)","v":"973378059"},{"$f":"VLOOKUP(B8,[1]Eproject!$A:$J,10,FALSE)","v":"Gu Jingfeng"},{"$f":"VLOOKUP(B8,[1]Eproject!$A:$P,16,FALSE)","v":"00:00:00"},{"$f":"VLOOKUP(E8,'[1]actual cost'!$F:$G,2,FALSE)","v":{"$error":"#N/A"}},{"$f":"VLOOKUP(E8,'[1]actual cost'!$F:$H,3,FALSE)","v":{"$error":"#N/A"}},{"$f":"VLOOKUP(E8,'[1]actual cost'!$F:$I,4,FALSE)","v":{"$error":"#N/A"}},{"$error":"#N/A"},{"$error":"#N/A"},{"$error":"#N/A"}]
[{"$f":"VLOOKUP(B9,[1]Eproject!$A:$B,2,FALSE)","v":"CBP/B"},15299,{"$f":"VLOOKUP(B9,[1]Eproject!$A:$C,3,FALSE)","v":"MOC"},{"$f":"VLOOKUP(B9,[1]Eproject!$A:$E,5,FALSE)","v":"Redesign& Reinstall the Fuel Oil Line from BD to EU Piperack"},{"$f":"VLOOKUP(B9,[1]Eproject!$A:$U,21,FALSE)","v":"973529386"},{"$f":"VLOOKUP(B9,[1]Eproject!$A:$J,10,FALSE)","v":"Wang Can"},{"$f":"VLOOKUP(B9,[1]Eproject!$A:$P,16,FALSE)","v":"00:00:00"},{"$f":"VLOOKUP(E9,'[1]actual cost'!$F:$G,2,FALSE)","v":{"$error":"#N/A"}},{"$f":"VLOOKUP(E9,'[1]actual cost'!$F:$H,3,FALSE)","v":{"$error":"#N/A"}},{"$f":"VLOOKUP(E9,'[1]actual cost'!$F:$I,4,FALSE)","v":{"$error":"#N/A"}},{"$error":"#N/A"},{"$error":"#N/A"},{"$error":"#N/A"}]
[{"$f":"VLOOKUP(B10,[1]Eproject!$A:$B,2,FALSE)","v":"CBP/S"},15294,{"$f":"VLOOKUP(B10,[1]Eproject!$A:$C,3,FALSE)","v":"MOC"},{"$f":"VLOOKUP(B10,[1]Eproject!$A:$E,5,FALSE)","v":"Adding H2 Detectors for Coldbox's Leakage"},{"$f":"VLOOKUP(B10,[1]Eproject!$A:$U,21,FALSE)","v":"973495739"},{"$f":"VLOOKUP(B10,[1]Eproject!$A:$J,10,FALSE)","v":"Gong Feibao"},{"$f":"VLOOKUP(B10,[1]Eproject!$A:$P,16,FALSE)","v":"00:00:00"},{"$f":"VLOOKUP(E10,'[1]actual cost'!$F:$G,2,FALSE)","v":{"v":121000,"d":"121,000 "}},{"$f":"VLOOKUP(E10,'[1]actual cost'!$F:$H,3,FALSE)","v":{"v":105859.22,"d":"105,859 "}},{"$f":"VLOOKUP(E10,'[1]actual cost'!$F:$I,4,FALSE)","v":{"v":65708.16,"d":"65,708 "}},{"v":40151.06,"d":"40,151"},{"v":105859.22,"d":"105,859 "},{"v":0.5430426446280991,"d":"54.30%"}]
[{"$f":"VLOOKUP(B11,[1]Eproject!$A:$B,2,FALSE)","v":"CEP/P"},15282,{"$f":"VLOOKUP(B11,[1]Eproject!$A:$C,3,FALSE)","v":"MOC"},{"$f":"VLOOKUP(B11,[1]Eproject!$A:$E,5,FALSE)","v":"Add Liquid Waste tank"},{"$f":"VLOOKUP(B11,[1]Eproject!$A:$U,21,FALSE)","v":"973471450"},{"$f":"VLOOKUP(B11,[1]Eproject!$A:$J,10,FALSE)","v":"Gu Jingfeng"},{"$f":"VLOOKUP(B11,[1]Eproject!$A:$P,16,FALSE)","v":"00:00:00"},{"$f":"VLOOKUP(E11,'[1]actual cost'!$F:$G,2,FALSE)","v":{"v":39050,"d":"39,050 "}},{"$f":"VLOOKUP(E11,'[1]actual cost'!$F:$H,3,FALSE)","v":{"v":0,"d":"0 "}},{"$f":"VLOOKUP(E11,'[1]actual cost'!$F:$I,4,FALSE)","v":{"v":6600,"d":"6,600 "}},0,{"v":6600,"d":"6,600 "},{"v":0.16901408450704225,"d":"16.90%"}]
[{"$f":"VLOOKUP(B12,[1]Eproject!$A:$B,2,FALSE)","v":"COA/A"},15280,{"$f":"VLOOKUP(B12,[1]Eproject!$A:$C,3,FALSE)","v":"MOC"},{"$f":"VLOOKUP(B12,[1]Eproject!$A:$E,5,FALSE)","v":"Add Local Pressure Gauge on Inlet P430"},{"$f":"VLOOKUP(B12,[1]Eproject!$A:$U,21,FALSE)","v":"973470849"},{"$f":"VLOOKUP(B12,[1]Eproject!$A:$J,10,FALSE)","v":"Meng Yousheng"},{"$f":"VLOOKUP(B12,[1]Eproject!$A:$P,16,FALSE)","v":"00:00:00"},{"$f":"VLOOKUP(E12,'[1]actual cost'!$F:$G,2,FALSE)","v":{"v":15000,"d":"15,000 "}},{"$f":"VLOOKUP(E12,'[1]actual cost'!$F:$H,3,FALSE)","v":{"v":9400,"d":"9,400 "}},{"$f":"VLOOKUP(E12,'[1]actual cost'!$F:$I,4,FALSE)","v":{"v":2750,"d":"2,750 "}},{"v":6650,"d":"6,650"},{"v":9400,"d":"9,400 "},{"v":0.18333333333333332,"d":"18.33%"}]
[{"$f":"VLOOKUP(B13,[1]Eproject!$A:$B,2,FALSE)","v":"CBP/C"},15276,{"$f":"VLOOKUP(B13,[1]Eproject!$A:$C,3,FALSE)","v":"MOC"},{"$f":"VLOOKUP(B13,[1]Eproject!$A:$E,5,FALSE)","v":"Modify the Gas Sampler Type to Closed Loop Sampler at  Prolysis Gasoline Unit(PGU)"},{"$f":"VLOOKUP(B13,[1]Eproject!$A:$U,21,FALSE)","v":"973482590"},{"$f":"VLOOKUP(B13,[1]Eproject!$A:$J,10,FALSE)","v":"Sun Aihong"},{"$f":"VLOOKUP(B13,[1]Eproject!$A:$P,16,FALSE)","v":"00:00:00"},{"$f":"VLOOKUP(E13,'[1]actual cost'!$F:$G,2,FALSE)","v":{"v":20000,"d":"20,000 "}},{"$f":"VLOOKUP(E13,'[1]actual cost'!$F:$H,3,FALSE)","v":{"v":17520,"d":"17,520 "}},{"$f":"VLOOKUP(E13,'[1]actual cost'!$F:$I,4,FALSE)","v":{"v":4400,"d":"4,400 "}},{"v":13120,"d":"13,120"},{"v":17520,"d":"17,520 "},{"v":0.22,"d":"22.00%"}]
[{"$f":"VLOOKUP(B14,[1]Eproject!$A:$B,2,FALSE)","v":"CBP/C"},15275,{"$f":"VLOOKUP(B14,[1]Eproject!$A:$C,3,FALSE)","v":"MOC"},{"$f":"VLOOKUP(B14,[1]Eproject!$A:$E,5,FALSE)","v":"Modify the EBO Product Sampler Type to Closed Loop Sampler at Quench Section"},{"$f":"VLOOKUP(B14,[1]Eproject!$A:$U,21,FALSE)","v":"973482589"},{"$f":"VLOOKUP(B14,[1]Eproject!$A:$J,10,FALSE)","v":"Sun Aihong"},{"$f":"VLOOKUP(B14,[1]Eproject!$A:$P,16,FALSE)","v":"00:00:00"},{"$f":"VLOOKUP(E14,'[1]actual cost'!$F:$G,2,FALSE)","v":{"v":20000,"d":"20,000 "}},{"$f":"VLOOKUP(E14,'[1]actual cost'!$F:$H,3,FALSE)","v":{"v":17520,"d":"17,520 "}},{"$f":"VLOOKUP(E14,'[1]actual cost'!$F:$I,4,FALSE)","v":{"v":0,"d":"0 "}},{"v":17520,"d":"17,520"},{"v":17520,"d":"17,520 "},{"v":0,"d":"0.00%"}]
[{"$f":"VLOOKUP(B15,[1]Eproject!$A:$B,2,FALSE)","v":"CTE"},15271,{"$f":"VLOOKUP(B15,[1]Eproject!$A:$C,3,FALSE)","v":"MOC"},{"$f":"VLOOKUP(B15,[1]Eproject!$A:$E,5,FALSE)","v":"Modification of Road Lamp at North Gate on the Yangba raod."},{"$f":"VLOOKUP(B15,[1]Eproject!$A:$U,21,FALSE)","v":"973487007"},{"$f":"VLOOKUP(B15,[1]Eproject!$A:$J,10,FALSE)","v":"Bian Jiacai"},{"$f":"VLOOKUP(B15,[1]Eproject!$A:$P,16,FALSE)","v":"00:00:00"},{"$f":"VLOOKUP(E15,'[1]actual cost'!$F:$G,2,FALSE)","v":{"v":119789,"d":"119,789 "}},{"$f":"VLOOKUP(E15,'[1]actual cost'!$F:$H,3,FALSE)","v":{"v":75265.27,"d":"75,265 "}},{"$f":"VLOOKUP(E15,'[1]actual cost'!$F:$I,4,FALSE)","v":{"v":5500,"d":"5,500 "}},{"v":69765.27,"d":"69,765"},{"v":75265.27,"d":"75,265 "},{"v":0.04591406556528563,"d":"4.59%"}]
{"$rows_left_out":127}