{"text_format":"3","workbook":"xlsx","n_sheets":4,"sheets":["Sheet1","Sheet4","Sheet6","Sheet5"],"not_rendered":{"external_links":1,"defined_names":1,"comments":1},"read":"whole","date_system":"1900"}

{"sheet":"Sheet1","index":0,"n_rows":1,"n_cols":9,"rows_kept":1}
["Month","JOB_NO","PROJECT_JOB_TYPE","BUDGET_ORG","Budget_CHK","ACTUAL","Commit_PO","Commit_SSR","Cost_To_CMPT"]

{"sheet":"Sheet4","index":1,"n_rows":163,"n_cols":41,"rows_kept":163,"hidden":true,"merged":[[0,0,0,38],[1,0,2,0],[1,1,2,1],[1,2,2,2],[1,3,2,3],[1,4,2,4],[1,5,2,5],[1,6,2,6],[1,7,2,7],[1,8,1,25],[1,26,2,26],[1,27,2,27],[1,28,2,28],[1,29,2,29],[1,30,1,31],[1,32,2,32],[1,33,2,33],[1,34,2,34],[1,35,1,36],[1,37,1,38],[1,39,1,40]]}
["Cost Overview for Projects"]
["B.U.","Job","Project Title","Job\nStatus","Lead\nBy","P.M.","C.M.","Approval\nDate","Hiden Information",{"$nulls":17},"Approved\nBudget\n1","Estimated\nFinal Cost\n5=2+3+4","Devi.(%)\n\n(5-1)/1","Actual\n\n2","Committed\n3",null,"Cost to\ncomplete\n4","Devi.(%)\n_POPR","Devi.(%)\n_SSR","Internal\nEngineering Cost",null,"Internal Const.Supervsn Cost",null,"Wrong Booking Indicator"]
[{"$nulls":8},"M.C.Date","TCCC Date","Business\nClosure Date","Priority","WBS\nAccount","Netowrk","Actual Cost\nMigrated?","Job No.","Original\nBudget","Budget\nChange","Final\ncost","Actual\ncost","Commitment","Rem.M.H\n(Eng)","Rem.M.H\n(Con.Sup)","Budget(used to calculate C2C)","Cost to\ncomplete","Saved\nCost",{"$nulls":4},"PR/PO","SSR",{"$nulls":3},"Rem M.H.\n/RMB","Compl\n(%)","Rem M.H.\n/RMB","Compl\n(%)","Material","SSR"]
["CBP/C",15292,"Modification of the Furnace Burners","On Going","CTE/P","Ding Juntao",0,"2015-12-31","00:00:00","00:00:00","00:00:00","N","ZNIC.011312","NZNIC015292K",null,15292,0,{"v":0,"d":"0 "},{"v":0,"d":"0 "},{"v":0,"d":"0 "},{"v":195339.88,"d":"195,340 "},{"v":90000,"d":"90,000 "},0,0,{"v":-285339.88,"d":"-285,340"},0,0,{"v":-90000,"d":"-90,000"},{"$error":"#DIV/0!"},0,{"v":195339.88,"d":"195,340"},0,{"v":-285339.88,"d":"-285,340"},{"$error":"#DIV/0!"},{"$error":"#DIV/0!"},{"v":90000,"d":"90,000"},{"v":0,"d":"0.00%"},0,{"$error":"#DIV/0!"},0,0]
["CEP/L",15278,"Upgrade the HIPS Palletizer","On Going","CTE/P","Zhou Yanduo","Wu Zefei","2015-12-30","00:00:00","00:00:00","00:00:00","N","ZNIC.011307","NZNIC015278K",null,15278,{"v":1826000,"d":"1,826,000"},{"v":0,"d":"0 "},{"v":0,"d":"0 "},{"v":0,"d":"0 "},{"v":0,"d":"0 "},{"v":117000,"d":"117,000 "},{"v":97000,"d":"97,000"},{"v":1826000,"d":"1,826,000"},{"v":1612000,"d":"1,612,000"},0,{"v":1826000,"d":"1,826,000"},{"v":1612000,"d":"1,612,000"},{"v":-0.1171960569550931,"d":"-11.72%"},0,0,0,{"v":1612000,"d":"1,612,000"},{"$error":"#DIV/0!"},{"$error":"#DIV/0!"},{"v":117000,"d":"117,000"},{"v":0,"d":"0.00%"},{"v":97000,"d":"97,000"},{"v":0,"d":"0.00%"},0,0]
["CTE",15277,"Add New Road Lamps at 5# Gate and ChengPin Road","On Going","CTE/A","Bian Jiacai","Sun Zhongpin","2015-12-22","00:00:00","00:00:00","00:00:00","N","ZNIF.623100.15.01","NZNIC015277K",null,15277,{"v":538000,"d":"538,000"},{"v":0,"d":"0 "},{"v":16500,"d":"16,500 "},{"v":14300,"d":"14,300 "},{"v":1110376.9,"d":"1,110,377 "},{"v":0,"d":"0 "},0,{"v":538000,"d":"538,000"},{"v":-586676.8999999999,"d":"-586,677"},0,{"v":538000,"d":"538,000"},{"v":538000,"d":"538,000"},{"v":0,"d":"0.00%"},{"v":14300,"d":"14,300"},{"v":1110376.9,"d":"1,110,377"},0,{"v":-586676.8999999999,"d":"-586,677"},{"$error":"#DIV/0!"},{"$error":"#DIV/0!"},0,{"$error":"#DIV/0!"},0,{"$error":"#DIV/0!"},0,0]
["CBP/U",15267,"Add a Pressure Control valve on CR Line","On Going","CTE/P","Yu Xiya","Jiang Haijing","2015-12-18","00:00:00","00:00:00","00:00:00","N","ZNIF.623350.15.01","NZNIC015267K",null,15267,{"v":676000,"d":"676,000"},{"v":0,"d":"0 "},{"v":0,"d":"0 "},{"v":0,"d":"0 "},{"v":1454957.27,"d":"1,454,957 "},{"v":90000,"d":"90,000 "},{"v":110000,"d":"110,000"},{"v":676000,"d":"676,000"},{"v":-978957.27,"d":"-978,957"},0,{"v":676000,"d":"676,000"},{"v":476000,"d":"476,000"},{"v":-0.2958579881656805,"d":"-29.59%"},0,{"v":1454957.27,"d":"1,454,957"},0,{"v":-978957.27,"d":"-978,957"},{"$error":"#DIV/0!"},{"$error":"#DIV/0!"},{"v":90000,"d":"90,000"},{"v":0,"d":"0.00%"},{"v":110000,"d":"110,000"},{"v":0,"d":"0.00%"},0,0]
["CBP/U",15263,"Adding Monitoring System for YBS Utility","Completed","CTE/A","Hu Xiao","Sun Zhongpin","2015-11-20","2015-12-31","00:00:00","00:00:00","H","ZNIF.620051.15.01","NZNIC015263K",null,15263,{"v":478000,"d":"478,000"},{"v":0,"d":"0 "},{"v":770390,"d":"770,390 "},{"v":0,"d":"0 "},{"v":746000,"d":"746,000 "},{"v":0,"d":"0 "},0,{"v":478000,"d":"478,000"},{"v":-479936.9,"d":"-479,937"},{"v":81646.9,"d":"81,647"},{"v":478000,"d":"478,000"},{"v":396353.1,"d":"396,353"},{"v":-0.17080941422594148,"d":"-17.08%"},0,{"v":746000,"d":"746,000"},{"v":130290,"d":"130,290"},{"v":-479936.9,"d":"-479,937"},{"v":-0.40935909129560727,"d":"-40.94%"},{"$error":"#DIV/0!"},0,{"$error":"#DIV/0!"},0,{"$error":"#DIV/0!"},0,0]
["COA/A",15256,"Add One Common Spare Motor for GAA Molten Salt Pumps","On Going","CTA/L","Zhu Qiang","N/A","2015-10-20","00:00:00","00:00:00","00:00:00","N","ZNIC.010728","NZNIC015256K",null,15256,{"v":2750000,"d":"2,750,000"},{"v":0,"d":"0 "},{"v":2750000,"d":"2,750,000 "},{"v":0,"d":"0 "},{"v":0,"d":"0 "},{"v":6000,"d":"6,000 "},0,{"v":2750000,"d":"2,750,000"},{"v":2744000,"d":"2,744,000"},0,{"v":2750000,"d":"2,750,000"},{"v":2744000,"d":"2,744,000"},{"v":-0.002181818181818182,"d":"-0.22%"},0,0,0,{"v":2744000,"d":"2,744,000"},{"$error":"#DIV/0!"},{"$error":"#DIV/0!"},{"v":6000,"d":"6,000"},{"v":0,"d":"0.00%"},0,{"$error":"#DIV/0!"},0,0]
["COA/A",15247,"B450/B550 MCC Modification","On Going","CTA/L","Yi Yongjun","Sun Zhongpin","2015-10-08","00:00:00","00:00:00","00:00:00","H","ZNIC.010582","NZNIC015247K",null,15247,{"v":3500000,"d":"3,500,000"},{"v":0,"d":"0 "},{"v":4610377,"d":"4,610,377 "},{"v":0,"d":"0 "},{"v":120980,"d":"120,980 "},{"v":109450,"d":"109,450 "},{"v":177250,"d":"177,250"},{"v":3500000,"d":"3,500,000"},{"v":2565096.9000000004,"d":"2,565,097"},{"v":527223.0999999999,"d":"527,223"},{"v":3500000,"d":"3,500,000"},{"v":2686076.9000000004,"d":"2,686,077"},{"v":-0.23254945714285705,"d":"-23.25%"},0,{"v":120980,"d":"120,980"},0,{"v":2565096.9000000004,"d":"2,565,097"},{"v":-0.3219486443575964,"d":"-32.19%"},{"$error":"#DIV/0!"},{"v":109450,"d":"109,450"},{"v":0.17083333333333334,"d":"17.08%"},{"v":177250,"d":"177,250"},{"v":0.015277777777777777,"d":"1.53%"},0,0]
["COA/E",15246,"C7100,C77100,C77400 Raplace the Boken Trays","On Going","CTM/A","Ling Wenqing","Shi Jinsong","2015-09-17","00:00:00","00:00:00","00:00:00","N","ZNIC.010345","NZNIC015246K",null,15246,{"v":2687000,"d":"2,687,000"},{"v":0,"d":"0 "},{"v":4141957,"d":"4,141,957 "},{"v":4675,"d":"4,675 "},{"v":0,"d":"0 "},{"v":0,"d":"0 "},0,{"v":2687000,"d":"2,687,000"},{"v":2384625.01,"d":"2,384,625"},{"v":297699.99,"d":"297,700"},{"v":2687000,"d":"2,687,000"},{"v":2389300.01,"d":"2,389,300"},{"v":-0.11079270189802762,"d":"-11.08%"},{"v":4675,"d":"4,675"},0,0,{"v":2384625.01,"d":"2,384,625"},{"v":-0.14884999499999998,"d":"-14.88%"},{"$error":"#DIV/0!"},0,{"$error":"#DIV/0!"},0,{"$error":"#DIV/0!"},0,0]
["COO/A",15245,"Install Filters on the Bottom Discharge Lines of C2300 and C2500","On Going","CTE/P","Zhang Bianlin","Jiang Haijin","2015-12-01","00:00:00","00:00:00","00:00:00","N","ZNIC.011107","NZNIC015245K",null,15245,{"v":1252000,"d":"1,252,000"},{"v":0,"d":"0 "},{"v":1998000,"d":"1,998,000 "},{"v":26282.42,"d":"26,282 "},{"v":15811.97,"d":"15,812 "},{"v":165600,"d":"165,600 "},{"v":130000,"d":"130,000"},{"v":1252000,"d":"1,252,000"},{"v":831728.56,"d":"831,729"},{"v":82577.04999999999,"d":"82,577"},{"v":1252000,"d":"1,252,000"},{"v":873822.9500000001,"d":"873,823"},{"v":-0.30205834664536735,"d":"-30.21%"},{"v":26282.42,"d":"26,282"},{"v":15811.97,"d":"15,812"},0,{"v":831728.56,"d":"831,729"},{"v":-0.2866521646083706,"d":"-28.67%"},{"$error":"#DIV/0!"},{"v":165600,"d":"165,600"},{"v":0.02588235294117647,"d":"2.59%"},{"v":130000,"d":"130,000"},{"v":0,"d":"0.00%"},0,0]
["CEP/S",15242,"Relocation the Cable of PS Plant","On Going","CTE/A","Bian Jiacai","Sun Zhongpin","2015-11-26","00:00:00","00:00:00","00:00:00","N","ZNIC.011082","NZNIC015242K",null,15242,{"v":3196000,"d":"3,196,000"},{"v":0,"d":"0 "},{"v":3196000,"d":"3,196,000 "},{"v":0,"d":"0 "},{"v":1560000,"d":"1,560,000 "},{"v":326670,"d":"326,670 "},{"v":198000,"d":"198,000"},{"v":3196000,"d":"3,196,000"},{"v":1111330,"d":"1,111,330"},0,{"v":3196000,"d":"3,196,000"},{"v":2671330,"d":"2,671,330"},{"v":-0.1641645807259074,"d":"-16.42%"},0,{"v":1560000,"d":"1,560,000"},0,{"v":1111330,"d":"1,111,330"},{"$error":"#DIV/0!"},{"$error":"#DIV/0!"},{"v":326670,"d":"326,670"},{"v":0.027767857142857143,"d":"2.78%"},{"v":198000,"d":"198,000"},{"v":0,"d":"0.00%"},0,0]
["CBP/B",15198,"Install two CCTVs in BD Plant","On Going","CTE/A","Hu Xiao","Chen Gang","2015-10-28","00:00:00","00:00:00","00:00:00","N","ZNIF.104500.15.03","NZNIC015198K",null,15198,{"v":217000,"d":"217,000"},{"v":0,"d":"0 "},{"v":337980,"d":"337,980 "},{"v":82419.39,"d":"82,419 "},{"v":0,"d":"0 "},{"v":0,"d":"0 "},0,{"v":217000,"d":"217,000"},{"v":132210.63,"d":"132,211"},{"v":2369.979999999996,"d":"2,370"},{"v":217000,"d":"217,000"},{"v":214630.02000000002,"d":"214,630"},{"v":-0.010921566820276412,"d":"-1.09%"},{"v":82419.39,"d":"82,419"},0,0,{"v":132210.63,"d":"132,211"},{"v":-0.019362581699346373,"d":"-1.94%"},{"$error":"#DIV/0!"},0,{"$error":"#DIV/0!"},0,{"$error":"#DIV/0!"},0,0]
["COO/C",15197,"Revamping of C1 Flare KO Drums","On Going","CTE/P","Li Shouqing","Jiang Haijin","2015-12-29","00:00:00","00:00:00","00:00:00","N","ZNIC.011291","NZNIC015197K",null,15197,{"v":1340000,"d":"1,340,000"},{"v":0,"d":"0 "},{"v":0,"d":"0 "},{"v":0,"d":"0 "},{"v":4201.71,"d":"4,202 "},{"v":231550,"d":"231,550 "},{"v":268125,"d":"268,125"},{"v":1340000,"d":"1,340,000"},{"v":836123.29,"d":"836,123"},0,{"v":1340000,"d":"1,340,000"},{"v":840325,"d":"840,325"},{"v":-0.3728917910447761,"d":"-37.29%"},0,{"v":4201.71,"d":"4,202"},0,{"v":836123.29,"d":"836,123"},{"$error":"#DIV/0!"},{"$error":"#DIV/0!"},{"v":231550,"d":"231,550"},{"v":0,"d":"0.00%"},{"v":268125,"d":"268,125"},{"v":0,"d":"0.00%"},0,0]
["CBL/P",15180,"Air Conditioning Replacement for Jetty1/2/3 Operation Room","Completed","CTE/C","Wang Wei","Wang Wei","2015-09-24","2015-11-26","00:00:00","00:00:00","N","ZNIF.604220.15.01","NZNIC015180K",null,15180,{"v":94000,"d":"94,000"},{"v":0,"d":"0 "},{"v":94000,"d":"94,000 "},{"v":127976.1,"d":"127,976 "},{"v":55137.76,"d":"55,138 "},{"v":-4675,"d":"(4,675)"},0,{"v":94000,"d":"94,000"},{"v":-89398.32000000002,"d":"-89,398"},{"v":284.46000000000004,"d":"284"},{"v":94000,"d":"94,000"},{"v":93715.54,"d":"93,716"},{"v":-3.0261702127660256E-3,"d":"-0.30%"},{"v":127976.1,"d":"127,976"},{"v":55137.76,"d":"55,138"},0,{"v":-89398.32000000002,"d":"-89,398"},{"$error":"#DIV/0!"},{"v":-0.043100000000000006,"d":"-4.31%"},0,{"$error":"#DIV/0!"},0,{"$error":"#DIV/0!"},0,0]
["CTM",15176,"Add Card Reader at D700 Central Workshop","On Going","CTE/A","Xu Zheng",0,"2015-08-31","00:00:00","00:00:00","00:00:00","N","ZNIF.642320.15.03","NZNIC015176K",null,15176,0,{"v":0,"d":"0 "},{"v":42094,"d":"42,094 "},{"v":46928.77,"d":"46,929 "},{"v":0,"d":"0 "},{"v":14090,"d":"14,090 "},{"v":39000,"d":"39,000"},0,{"v":-99651.94,"d":"-99,652"},{"v":-366.82999999999447,"d":"-367"},0,{"v":-52723.170000000006,"d":"-52,723"},{"$error":"#DIV/0!"},{"v":46928.77,"d":"46,929"},0,0,{"v":-99651.94,"d":"-99,652"},{"v":0.01111934249684587,"d":"1.11%"},{"$error":"#DIV/0!"},{"v":14090,"d":"14,090"},{"v":0.4967857142857143,"d":"49.68%"},{"v":39000,"d":"39,000"},{"v":0,"d":"0.00%"},0,0]
["CEP/S",15168,"PS Chilling Unit Replacement","On Going","CTE/P","Gu Jingfeng","Wu Zefei","2015-11-20","00:00:00","00:00:00","00:00:00","N","ZNIC.011038","NZNIC015168K",null,15168,{"v":2910000,"d":"2,910,000"},{"v":0,"d":"0 "},{"v":4470000,"d":"4,470,000 "},{"v":21726,"d":"21,726 "},{"v":11218.88,"d":"11,219 "},{"v":270050,"d":"270,050 "},{"v":245575,"d":"245,575"},{"v":2910000,"d":"2,910,000"},{"v":2361430.12,"d":"2,361,430"},0,{"v":2910000,"d":"2,910,000"},{"v":2394375,"d":"2,394,375"},{"v":-0.17719072164948454,"d":"-17.72%"},{"v":21726,"d":"21,726"},{"v":11218.88,"d":"11,219"},0,{"v":2361430.12,"d":"2,361,430"},{"$error":"#DIV/0!"},{"$error":"#DIV/0!"},{"v":270050,"d":"270,050"},{"v":0.06297709923664122,"d":"6.30%"},{"v":245575,"d":"245,575"},{"v":0,"d":"0.00%"},0,0]
["CBP/C",15167,"Add Adjusters for One of the Furnaces Bottom Air Registers","On Going","CTE/P","Zhou Yanduo","Ling Taizhong","2015-12-30","00:00:00","00:00:00","00:00:00","N","ZNIC.011308","NZNIC015167K",null,15167,{"v":1490000,"d":"1,490,000"},{"v":0,"d":"0 "},{"v":0,"d":"0 "},{"v":58781.93,"d":"58,782 "},{"v":5420,"d":"5,420 "},{"v":162525,"d":"162,525 "},{"v":145200,"d":"145,200"},{"v":1490000,"d":"1,490,000"},{"v":1118073.07,"d":"1,118,073"},0,{"v":1490000,"d":"1,490,000"},{"v":1182275,"d":"1,182,275"},{"v":-0.2065268456375839,"d":"-20.65%"},{"v":58781.93,"d":"58,782"},{"v":5420,"d":"5,420"},0,{"v":1118073.07,"d":"1,118,073"},{"$error":"#DIV/0!"},{"$error":"#DIV/0!"},{"v":162525,"d":"162,525"},{"v":0,"d":"0.00%"},{"v":145200,"d":"145,200"},{"v":0,"d":"0.00%"},0,0]
["CBP/M",15149,"Steel Structure Extension of Gas Cylinder Room of CTS/L","On Going","CTE/C","Wang Shicheng","Zhang Zhihe","2015-09-30","00:00:00","00:00:00","00:00:00","N","ZNIF.660300.15.01","NZNIC015149K",null,15149,{"v":264000,"d":"264,000"},{"v":0,"d":"0 "},{"v":377771,"d":"377,771 "},{"v":11000,"d":"11,000 "},{"v":140000,"d":"140,000 "},{"v":-69360,"d":"(69,360)"},{"v":-11000,"d":"-11,000"},{"v":264000,"d":"264,000"},{"v":-6932.83,"d":"-6,933"},{"v":1104.8299999999997,"d":"1,105"},{"v":264000,"d":"264,000"},{"v":262895.17,"d":"262,895"},{"v":-0.004184962121212183,"d":"-0.42%"},{"v":11000,"d":"11,000"},{"v":140000,"d":"140,000"},{"v":118828,"d":"118,828"},{"v":-6932.83,"d":"-6,933"},{"v":-0.04967252554687989,"d":"-4.97%"},{"v":-0.29588,"d":"-29.59%"},0,{"$error":"#DIV/0!"},0,{"$error":"#DIV/0!"},0,1]
["CBP/C",15143,"Add Combustible Gas Detector in BCC Cylinder Room","On Going","CTE/A","Gong Feibao","Li Hong","2015-10-30","00:00:00","00:00:00","00:00:00","N","ZNIF.104100.15.06","NZNIC015143K",null,15143,{"v":70000,"d":"70,000"},{"v":0,"d":"0 "},{"v":74202,"d":"74,202 "},{"v":186315.85,"d":"186,316 "},{"v":53878.98,"d":"53,879 "},{"v":7400,"d":"7,400 "},{"v":19000,"d":"19,000"},{"v":70000,"d":"70,000"},{"v":-197178.83000000002,"d":"-197,179"},584,{"v":70000,"d":"70,000"},{"v":43016,"d":"43,016"},{"v":-0.38548571428571426,"d":"-38.55%"},{"v":186315.85,"d":"186,316"},{"v":53878.98,"d":"53,879"},0,{"v":-197178.83000000002,"d":"-197,179"},{"v":-0.10618181818181818,"d":"-10.62%"},{"$error":"#DIV/0!"},{"v":7400,"d":"7,400"},{"v":0.4714285714285714,"d":"47.14%"},{"v":19000,"d":"19,000"},{"v":0,"d":"0.00%"},0,0]
["CBP/B",15124,"Add Pump and Flow Control Valve on the Line for Sending Dimer to C-250","On Going","CTE/P","Chen Chen","Ling Taizhong","2015-07-27","00:00:00","00:00:00","00:00:00","T","ZNIF.104500.15.01","NZNIC015124K",null,15124,{"v":730000,"d":"730,000"},{"v":0,"d":"0 "},{"v":785138,"d":"785,138 "},{"v":36705,"d":"36,705 "},{"v":25936.29,"d":"25,936 "},{"v":96600,"d":"96,600 "},{"v":142450,"d":"142,450"},{"v":730000,"d":"730,000"},{"v":385728.61,"d":"385,729"},{"v":42580.09999999998,"d":"42,580"},{"v":730000,"d":"730,000"},{"v":448369.89999999997,"d":"448,370"},{"v":-0.38579465753424663,"d":"-38.58%"},{"v":36705,"d":"36,705"},{"v":25936.29,"d":"25,936"},0,{"v":385728.61,"d":"385,729"},{"v":-0.24213438972979548,"d":"-24.21%"},{"$error":"#DIV/0!"},{"v":96600,"d":"96,600"},{"v":0.4215568862275449,"d":"42.16%"},{"v":142450,"d":"142,450"},{"v":0.075,"d":"7.50%"},0,0]
["CTM",15122,"D700 Garbage Disposal Field Modification","On Going","CTE/C","Xia Qun","Xu Zhaofeng","2015-07-16","00:00:00","00:00:00","00:00:00","N","ZNIF.642320.15.02","NZNIC015122K",null,15122,{"v":369430,"d":"369,430"},{"v":0,"d":"0 "},{"v":607585,"d":"607,585 "},{"v":25300,"d":"25,300 "},{"v":277846.76,"d":"277,847 "},{"v":37355,"d":"37,355 "},{"v":42100,"d":"42,100"},{"v":369430,"d":"369,430"},{"v":-254390.99000000002,"d":"-254,391"},{"v":164.23000000000002,"d":"164"},{"v":369430,"d":"369,430"},{"v":289810.77,"d":"289,811"},{"v":-0.2155191240559781,"d":"-21.55%"},{"v":25300,"d":"25,300"},{"v":277846.76,"d":"277,847"},{"v":241055,"d":"241,055"},{"v":-254390.99000000002,"d":"-254,391"},{"$error":"#DIV/0!"},{"v":-0.08019042968750001,"d":"-8.02%"},{"v":37355,"d":"37,355"},{"v":0.5210897435897436,"d":"52.11%"},{"v":42100,"d":"42,100"},{"v":0.19038461538461537,"d":"19.04%"},0,1]
["CBP/C",15117,"Add the Differential Pressure Signal of the Instrument Air Filter in DCS System","On Going","CTE/P","Zhang Fanwen","Li Hong","2015-09-10","00:00:00","00:00:00","00:00:00","N","ZNIF.104100.15.04","NZNIC015117K",null,15117,{"v":98000,"d":"98,000"},{"v":0,"d":"0 "},{"v":109219,"d":"109,219 "},{"v":27300,"d":"27,300 "},{"v":269230.77,"d":"269,231 "},{"v":-20140,"d":"(20,140)"},{"v":-1100,"d":"-1,100"},{"v":98000,"d":"98,000"},{"v":-213311.89,"d":"-213,312"},{"v":14781.12,"d":"14,781"},{"v":98000,"d":"98,000"},{"v":83218.88,"d":"83,219"},{"v":-0.15082775510204077,"d":"-15.08%"},{"v":27300,"d":"27,300"},{"v":269230.77,"d":"269,231"},0,{"v":-213311.89,"d":"-213,312"},{"v":-0.5685046153846154,"d":"-56.85%"},{"$error":"#DIV/0!"},0,{"$error":"#DIV/0!"},0,{"$error":"#DIV/0!"},0,0]
["CEP/E",15116,"Set a Waste Storage Area beside Tank Farm","On Going","CTE/C","Yan Jun","Xu Zhaofeng","2015-08-20","00:00:00","00:00:00","00:00:00","H","ZNIF.105600.15.01","NZNIC015116K",null,15116,{"v":382000,"d":"382,000"},{"v":0,"d":"0 "},{"v":475340,"d":"475,340 "},{"v":54160,"d":"54,160 "},{"v":2751751.23,"d":"2,751,751 "},{"v":63030,"d":"63,030 "},{"v":98900,"d":"98,900"},{"v":382000,"d":"382,000"},{"v":-2670277.27,"d":"-2,670,277"},{"v":-3483.959999999999,"d":"-3,484"},{"v":382000,"d":"382,000"},{"v":223553.95999999996,"d":"223,554"},{"v":-0.4147802094240839,"d":"-41.48%"},{"v":54160,"d":"54,160"},{"v":2751751.23,"d":"2,751,751"},{"v":87920,"d":"87,920"},{"v":-2670277.27,"d":"-2,670,277"},{"v":0.06873192289231354,"d":"6.87%"},{"$error":"#DIV/0!"},{"v":63030,"d":"63,030"},{"v":0.30736263736263736,"d":"30.74%"},{"v":98900,"d":"98,900"},{"v":0.011,"d":"1.10%"},0,0]
["CBL/P",15112,"Add Emergency Storage Area for Jettys in CLTF Reserved Land","On Going","CTE/P","Yu Yi","Guo Yibing","2015-10-28","00:00:00","00:00:00","00:00:00","N","ZNIF.604110.15.01","NZNIC015112K",null,15112,{"v":970000,"d":"970,000"},{"v":0,"d":"0 "},{"v":1584746,"d":"1,584,746 "},{"v":239017.94,"d":"239,018 "},{"v":1924799.22,"d":"1,924,799 "},{"v":10805,"d":"10,805 "},{"v":47000,"d":"47,000"},{"v":970000,"d":"970,000"},{"v":-1735496.16,"d":"-1,735,496"},{"v":9128,"d":"9,128"},{"v":970000,"d":"970,000"},{"v":903067.0000000002,"d":"903,067"},{"v":-0.06900309278350492,"d":"-6.90%"},{"v":239017.94,"d":"239,018"},{"v":1924799.22,"d":"1,924,799"},{"v":474746,"d":"474,746"},{"v":-1735496.16,"d":"-1,735,496"},{"v":-0.0652,"d":"-6.52%"},{"$error":"#DIV/0!"},{"v":10805,"d":"10,805"},{"v":0.5678,"d":"56.78%"},{"v":47000,"d":"47,000"},{"v":0,"d":"0.00%"},0,0]
["CTM",15102,"Cleaning Room Renovation Project of Central Workshop","On Going","CTM/W","Zhai Chunrong","Lei Fucun","2015-07-16","00:00:00","00:00:00","00:00:00","N","ZNIF.642320.15.01","NZNIC015102K",null,15102,{"v":958000,"d":"958,000"},{"v":0,"d":"0 "},{"v":1566340,"d":"1,566,340 "},{"v":852242.9,"d":"852,243 "},{"v":41000,"d":"41,000 "},{"v":-11457.149999999994,"d":"(11,457)"},{"v":44000,"d":"44,000"},{"v":958000,"d":"958,000"},{"v":-608712.17,"d":"-608,712"},{"v":55008.77000000001,"d":"55,009"},{"v":958000,"d":"958,000"},{"v":858991.2299999999,"d":"858,991"},{"v":-0.103349446764092,"d":"-10.33%"},{"v":852242.9,"d":"852,243"},{"v":41000,"d":"41,000"},{"v":574460.5,"d":"574,461"},{"v":-608712.17,"d":"-608,712"},{"v":-0.3736162585034014,"d":"-37.36%"},{"v":-0.14529999999999993,"d":"-14.53%"},0,{"v":1.0670008771929824,"d":"106.70%"},{"v":44000,"d":"44,000"},{"v":0,"d":"0.00%"},0,1]
["CBP/M",15097,"Improve Operation Method for Compound TBC","On Going","CTE/P","Wang Can","Ling Taizhong","2015-12-23","00:00:00","00:00:00","00:00:00","N","ZNIF.104400.15.01","NZNIC015097K",null,15097,{"v":598000,"d":"598,000"},{"v":0,"d":"0 "},{"v":0,"d":"0 "},{"v":30380,"d":"30,380 "},{"v":587777.78,"d":"587,778 "},{"v":183000,"d":"183,000 "},{"v":142000,"d":"142,000"},{"v":598000,"d":"598,000"},{"v":-345157.78,"d":"-345,158"},0,{"v":598000,"d":"598,000"},{"v":273000,"d":"273,000"},{"v":-0.5434782608695652,"d":"-54.35%"},{"v":30380,"d":"30,380"},{"v":587777.78,"d":"587,778"},0,{"v":-345157.78,"d":"-345,158"},{"$error":"#DIV/0!"},{"$error":"#DIV/0!"},{"v":183000,"d":"183,000"},{"v":0,"d":"0.00%"},{"v":142000,"d":"142,000"},{"v":0,"d":"0.00%"},0,0]
["CBP/C",15091,"Add a New Solid Waste Storage Area","Canceled","CTE/C","Wang Shicheng","Zhang Zhihe","2015-12-07","00:00:00","00:00:00","00:00:00","N","ZNIF.104100.15.08","NZNIC015091K",null,15091,{"v":257000,"d":"257,000"},{"v":0,"d":"0 "},{"v":0,"d":"0 "},{"v":183454.06,"d":"183,454 "},{"v":0,"d":"0 "},{"v":47000,"d":"47,000 "},{"v":56000,"d":"56,000"},{"v":257000,"d":"257,000"},{"v":-29454.059999999998,"d":"-29,454"},0,{"v":257000,"d":"257,000"},{"v":154000,"d":"154,000"},{"v":-0.40077821011673154,"d":"-40.08%"},{"v":183454.06,"d":"183,454"},0,0,{"v":-29454.059999999998,"d":"-29,454"},{"$error":"#DIV/0!"},{"$error":"#DIV/0!"},{"v":47000,"d":"47,000"},{"v":0,"d":"0.00%"},{"v":56000,"d":"56,000"},{"v":0,"d":"0.00%"},0,0]
["CBP/C",15089,"Modify Lubrication oil Room and Spare Parts Stroge Room at West of Control Building","On Going","CTE/C","Wang Shicheng","Zhang Zhihe","2015-12-07","00:00:00","00:00:00","00:00:00","N","ZNIF.104100.15.07","NZNIC015089K",null,15089,{"v":752000,"d":"752,000"},{"v":0,"d":"0 "},{"v":0,"d":"0 "},{"v":5306.45,"d":"5,306 "},{"v":23852.16,"d":"23,852 "},{"v":122000,"d":"122,000 "},{"v":94000,"d":"94,000"},{"v":752000,"d":"752,000"},{"v":506841.39,"d":"506,841"},0,{"v":752000,"d":"752,000"},{"v":536000,"d":"536,000"},{"v":-0.2872340425531915,"d":"-28.72%"},{"v":5306.45,"d":"5,306"},{"v":23852.16,"d":"23,852"},0,{"v":506841.39,"d":"506,841"},{"$error":"#DIV/0!"},{"$error":"#DIV/0!"},{"v":122000,"d":"122,000"},{"v":0,"d":"0.00%"},{"v":94000,"d":"94,000"},{"v":0,"d":"0.00%"},0,0]
["CTM",15079,"Fire Alarm System Modification for #5 Warehouse in East Laydown","On Going","CTE/A","Bian Jiacai","Sun Zhongpin","2015-07-24","00:00:00","00:00:00","00:00:00","N","ZNIF.641330.15.01","NZNIC015079K",null,15079,{"v":220000,"d":"220,000"},{"v":0,"d":"0 "},{"v":262386,"d":"262,386 "},{"v":14640,"d":"14,640 "},{"v":810000,"d":"810,000 "},{"v":-37045,"d":"(37,045)"},{"v":-2475,"d":"-2,475"},{"v":220000,"d":"220,000"},{"v":-682344.53,"d":"-682,345"},{"v":8654.529999999999,"d":"8,655"},{"v":220000,"d":"220,000"},{"v":211345.46999999997,"d":"211,345"},{"v":-0.039338772727272854,"d":"-3.93%"},{"v":14640,"d":"14,640"},{"v":810000,"d":"810,000"},{"v":69050,"d":"69,050"},{"v":-682344.53,"d":"-682,345"},{"v":-0.2219110256410256,"d":"-22.19%"},{"$error":"#DIV/0!"},0,{"$error":"#DIV/0!"},0,{"$error":"#DIV/0!"},0,0]
["CEP/P",15071,"Build a Spare Part&Tool Warehouse","On Going","CTE/C","Gao Feng","Xia Weiguang","2015-10-21","00:00:00","00:00:00","00:00:00","H","ZNIC.010748","NZNIC015071K",null,15071,{"v":1222000,"d":"1,222,000"},{"v":0,"d":"0 "},{"v":1499847,"d":"1,499,847 "},{"v":102162.89,"d":"102,163 "},{"v":787059.83,"d":"787,060 "},{"v":119350,"d":"119,350 "},{"v":129250,"d":"129,250"},{"v":1222000,"d":"1,222,000"},{"v":-479485.71999999986,"d":"-479,486"},200,{"v":1222000,"d":"1,222,000"},{"v":973200.0000000001,"d":"973,200"},{"v":-0.20360065466448435,"d":"-20.36%"},{"v":102162.89,"d":"102,163"},{"v":787059.83,"d":"787,060"},{"v":563463,"d":"563,463"},{"v":-479485.71999999986,"d":"-479,486"},{"v":-0.2,"d":"-20.00%"},{"$error":"#DIV/0!"},{"v":119350,"d":"119,350"},{"v":0.3654970760233918,"d":"36.55%"},{"v":129250,"d":"129,250"},{"v":0,"d":"0.00%"},0,0]
["CBL/P",15066,"Add On-line Water Analyzer on the NAP Unloading Piping of Jetty 4#","On Going","CTE/A","Xu Ge","Wang Xinwu","2015-08-31","00:00:00","00:00:00","00:00:00","N","ZNIF.651130.15.01","NZNIC015066K",null,15066,{"v":547000,"d":"547,000"},{"v":0,"d":"0 "},{"v":816231,"d":"816,231 "},{"v":44429.04,"d":"44,429 "},{"v":140597.78,"d":"140,598 "},{"v":39800,"d":"39,800 "},{"v":34500,"d":"34,500"},{"v":547000,"d":"547,000"},{"v":296712.98000000004,"d":"296,713"},{"v":-15039.799999999988,"d":"-15,040"},{"v":547000,"d":"547,000"},{"v":487739.80000000005,"d":"487,740"},{"v":-0.10833674588665439,"d":"-10.83%"},{"v":44429.04,"d":"44,429"},{"v":140597.78,"d":"140,598"},{"v":6000,"d":"6,000"},{"v":296712.98000000004,"d":"296,713"},{"v":0.049658428672840996,"d":"4.97%"},{"$error":"#DIV/0!"},{"v":39800,"d":"39,800"},{"v":0.3254237288135593,"d":"32.54%"},{"v":34500,"d":"34,500"},{"v":0.3235294117647059,"d":"32.35%"},0,0]
["CTS",15061,"BCC Lab Modification","On Going","CTE/C","Yu Yi","Jiang Yunning","2015-06-11","00:00:00","00:00:00","00:00:00","N","ZNIC.009551","NZNIC015061K",null,15061,{"v":3490000,"d":"3,490,000"},{"v":290000,"d":"290,000 "},{"v":6411751,"d":"6,411,751 "},{"v":928395.84,"d":"928,396 "},{"v":11111.11,"d":"11,111 "},{"v":75640,"d":"75,640 "},{"v":69300,"d":"69,300"},{"v":3490000,"d":"3,490,000"},{"v":2515801.6900000004,"d":"2,515,802"},{"v":-292248.64000000013,"d":"-292,249"},{"v":3780000,"d":"3,780,000"},{"v":3637308.6400000006,"d":"3,637,309"},{"v":-0.03774903703703688,"d":"-3.77%"},{"v":928395.84,"d":"928,396"},{"v":11111.11,"d":"11,111"},{"v":182000,"d":"182,000"},{"v":2515801.6900000004,"d":"2,515,802"},{"v":0.100306920010119,"d":"10.03%"},{"$error":"#DIV/0!"},{"v":75640,"d":"75,640"},{"v":0.322525750111957,"d":"32.25%"},{"v":69300,"d":"69,300"},{"v":0.26744186046511625,"d":"26.74%"},0,1]
["C",15051,"Set Up Intranet Portal System","On Going","CGA/I","Tao Yang","Tao Yang","2015-03-18","00:00:00","00:00:00","00:00:00","N","ZNIT.001180","NZNIC015051K",null,15051,{"v":2735000,"d":"2,735,000"},{"v":0,"d":"0 "},{"v":4659799,"d":"4,659,799 "},{"v":0,"d":"0 "},{"v":4542735.05,"d":"4,542,735 "},{"v":0,"d":"0 "},0,{"v":2735000,"d":"2,735,000"},{"v":-1807735.0499999998,"d":"-1,807,735"},0,{"v":2735000,"d":"2,735,000"},{"v":2735000,"d":"2,735,000"},{"v":0,"d":"0.00%"},0,{"v":4542735.05,"d":"4,542,735"},0,{"v":-1807735.0499999998,"d":"-1,807,735"},{"v":0,"d":"0.00%"},{"$error":"#DIV/0!"},0,{"$error":"#DIV/0!"},0,{"$error":"#DIV/0!"},0,0]
["CBP/P",15047,"Change New CEMS","On Going","CTA/S","Tang Yiqun","Tang Yiqun","2015-03-10","00:00:00","00:00:00","00:00:00","N","ZNIC.008734","NZNIC015047K",null,15047,{"v":1203000,"d":"1,203,000"},{"v":0,"d":"0 "},{"v":1344000,"d":"1,344,000 "},{"v":464825.16,"d":"464,825 "},{"v":0,"d":"0 "},{"v":5500,"d":"5,500 "},0,{"v":1203000,"d":"1,203,000"},{"v":426442.6300000001,"d":"426,443"},{"v":206232.21,"d":"206,232"},{"v":1203000,"d":"1,203,000"},{"v":991267.79,"d":"991,268"},{"v":-0.17600349958437236,"d":"-17.60%"},{"v":464825.16,"d":"464,825"},0,{"v":100000,"d":"100,000"},{"v":426442.6300000001,"d":"426,443"},{"v":-0.16645215071972905,"d":"-16.65%"},{"v":-0.32174066666666673,"d":"-32.17%"},{"v":5500,"d":"5,500"},{"v":0,"d":"0.00%"},0,{"$error":"#DIV/0!"},0,0]
["CBP/C",15042,"Add On-line Analyzer on the Outlet of the Z-908","On Going","CTE/A","Gong Feibao","Li Hong","2015-10-21","00:00:00","00:00:00","00:00:00","H","ZNIC.010800","NZNIC015042K",null,15042,{"v":1145000,"d":"1,145,000"},{"v":0,"d":"0 "},{"v":1732778,"d":"1,732,778 "},{"v":6520,"d":"6,520 "},{"v":242000,"d":"242,000 "},{"v":148435,"d":"148,435 "},{"v":105300,"d":"105,300"},{"v":1145000,"d":"1,145,000"},{"v":522104,"d":"522,104"},{"v":120641,"d":"120,641"},{"v":1145000,"d":"1,145,000"},{"v":770624,"d":"770,624"},{"v":-0.3269659388646288,"d":"-32.70%"},{"v":6520,"d":"6,520"},{"v":242000,"d":"242,000"},0,{"v":522104,"d":"522,104"},{"v":-0.19917615981509,"d":"-19.92%"},{"$error":"#DIV/0!"},{"v":148435,"d":"148,435"},{"v":0.271931330472103,"d":"27.19%"},{"v":105300,"d":"105,300"},{"v":0.1404081632653061,"d":"14.04%"},0,0]
["CBP/C",15036,"Expand the Capacity of the Suspect Condensate Vent Condenser 390-E-920","Completed","CTE/P","Ding Juntao","Tong Shaojian","2015-05-11","2015-10-16","00:00:00","00:00:00","H","ZNIF.104100.15.02","NZNIC015036K",null,15036,{"v":398000,"d":"398,000"},{"v":0,"d":"0 "},{"v":398000,"d":"398,000 "},{"v":38205,"d":"38,205 "},{"v":227706.96,"d":"227,707 "},{"v":57450,"d":"57,450 "},{"v":28000,"d":"28,000"},{"v":398000,"d":"398,000"},{"v":12691.770000000011,"d":"12,692"},{"v":33946.27,"d":"33,946"},{"v":398000,"d":"398,000"},{"v":278603.73,"d":"278,604"},{"v":-0.29999062814070354,"d":"-30.00%"},{"v":38205,"d":"38,205"},{"v":227706.96,"d":"227,707"},0,{"v":12691.770000000011,"d":"12,692"},{"v":-0.2232267333333333,"d":"-22.32%"},{"v":-0.0711169230769231,"d":"-7.11%"},{"v":57450,"d":"57,450"},{"v":0.5775735294117647,"d":"57.76%"},{"v":28000,"d":"28,000"},{"v":0,"d":"0.00%"},0,0]
["CBP/C",15034,"Add Pressure&Temperature Signal DCS System for Three Drums at AEU Section","On Going","CTE/A","Gong Feibao","Li Hong","2015-09-18","00:00:00","00:00:00","00:00:00","N","ZNIF.104100.15.05","NZNIC015034K",null,15034,{"v":170000,"d":"170,000"},{"v":0,"d":"0 "},{"v":193852,"d":"193,852 "},{"v":161613.1,"d":"161,613 "},{"v":82138.68,"d":"82,139 "},{"v":0,"d":"0 "},-550,{"v":170000,"d":"170,000"},{"v":-80263.18,"d":"-80,263"},{"v":6511.399999999994,"d":"6,511"},{"v":170000,"d":"170,000"},{"v":163488.6,"d":"163,489"},{"v":-0.03830235294117643,"d":"-3.83%"},{"v":161613.1,"d":"161,613"},{"v":82138.68,"d":"82,139"},0,{"v":-80263.18,"d":"-80,263"},{"v":-0.2144776533350196,"d":"-21.45%"},{"$error":"#DIV/0!"},0,{"$error":"#DIV/0!"},0,{"$error":"#DIV/0!"},0,0]
["CEP/P",15028,"Upgrade 4 sets PO Cupboard Freezer","On Going","CTE/P","Ding Juntao","Wang Yuncai","2015-10-19","00:00:00","00:00:00","00:00:00","T","ZNIC.010799","NZNIC015028K",null,15028,{"v":1319000,"d":"1,319,000"},{"v":0,"d":"0 "},{"v":2129000,"d":"2,129,000 "},{"v":1000127.52,"d":"1,000,128 "},{"v":5128.21,"d":"5,128 "},{"v":122310,"d":"122,310 "},{"v":50050,"d":"50,050"},{"v":1319000,"d":"1,319,000"},{"v":119898.43,"d":"119,898"},{"v":21485.839999999967,"d":"21,486"},{"v":1319000,"d":"1,319,000"},{"v":1125154.16,"d":"1,125,154"},{"v":-0.1469642456406369,"d":"-14.70%"},{"v":1000127.52,"d":"1,000,128"},{"v":5128.21,"d":"5,128"},0,{"v":119898.43,"d":"119,898"},{"v":-0.026525728395061687,"d":"-2.65%"},{"$error":"#DIV/0!"},{"v":122310,"d":"122,310"},{"v":0.14468531468531468,"d":"14.47%"},{"v":50050,"d":"50,050"},{"v":0.08080808080808081,"d":"8.08%"},0,0]
["CEP/S",15026,"PS Positive Draft of Control Building Modification","On Going","CTE/C","Gao Feng","Wang Wei","2015-07-09","00:00:00","00:00:00","00:00:00","H","ZNIC.009794","NZNIC015026K",null,15026,{"v":1256000,"d":"1,256,000"},{"v":0,"d":"0 "},{"v":2062440,"d":"2,062,440 "},{"v":53990,"d":"53,990 "},{"v":1072456.67,"d":"1,072,457 "},{"v":73910.85,"d":"73,911 "},{"v":53350,"d":"53,350"},{"v":1256000,"d":"1,256,000"},{"v":-65629.77999999988,"d":"-65,630"},{"v":-12216.58000000005,"d":"-12,217"},{"v":1256000,"d":"1,256,000"},{"v":1140955.7300000002,"d":"1,140,956"},{"v":-0.09159575636942659,"d":"-9.16%"},{"v":53990,"d":"53,990"},{"v":1072456.67,"d":"1,072,457"},{"v":80138.84,"d":"80,139"},{"v":-65629.77999999988,"d":"-65,630"},{"v":0.01332797801478095,"d":"1.33%"},{"v":-0.05660416666666663,"d":"-5.66%"},{"v":73910.85,"d":"73,911"},{"v":0.5268191421254801,"d":"52.68%"},{"v":53350,"d":"53,350"},{"v":0.19166666666666668,"d":"19.17%"},0,1]
["COA/S",15024,"SAP Steam System Energy Saving Modification","On Going","CTE/P","Xu Jin","Wang Yuncai","2015-09-18","00:00:00","00:00:00","00:00:00","N","ZNIC.010440","NZNIC015024K",null,15024,{"v":1419000,"d":"1,419,000"},{"v":0,"d":"0 "},{"v":1559598,"d":"1,559,598 "},{"v":1716239.32,"d":"1,716,239 "},{"v":0,"d":"0 "},{"v":132100,"d":"132,100 "},{"v":196900,"d":"196,900"},{"v":1419000,"d":"1,419,000"},{"v":-656256.2400000001,"d":"-656,256"},{"v":27516.920000000042,"d":"27,517"},{"v":1419000,"d":"1,419,000"},{"v":1062483.08,"d":"1,062,483"},{"v":-0.2512451867512332,"d":"-25.12%"},{"v":1716239.32,"d":"1,716,239"},0,{"v":2500,"d":"2,500"},{"v":-656256.2400000001,"d":"-656,256"},{"v":-0.1546370455623419,"d":"-15.46%"},{"$error":"#DIV/0!"},{"v":132100,"d":"132,100"},{"v":0.1297760210803689,"d":"12.98%"},{"v":196900,"d":"196,900"},{"v":0.05789473684210526,"d":"5.79%"},0,0]
["CEP/E",15022,"Revamp HVAC System in EOEG Control Building","Completed","CTE/C","Gao Feng","Wang Wei","2015-05-07","2015-12-04","00:00:00","00:00:00","H","ZNIC.009264","NZNIC015022K",null,15022,{"v":1391000,"d":"1,391,000"},{"v":0,"d":"0 "},{"v":1473957,"d":"1,473,957 "},{"v":2061289.79,"d":"2,061,290 "},{"v":0,"d":"0 "},{"v":56686.98999999999,"d":"56,687 "},{"v":4950,"d":"4,950"},{"v":1391000,"d":"1,391,000"},{"v":-577421.19,"d":"-577,421"},{"v":-164661.59000000003,"d":"-164,662"},{"v":1391000,"d":"1,391,000"},{"v":1494024.6,"d":"1,494,025"},{"v":0.07406513299784334,"d":"7.41%"},{"v":2061289.79,"d":"2,061,290"},0,{"v":10156,"d":"10,156"},{"v":-577421.19,"d":"-577,421"},{"v":0.19386503067484662,"d":"19.39%"},{"v":0.10521511829927048,"d":"10.52%"},{"v":56686.98999999999,"d":"56,687"},{"v":0.6095937327823692,"d":"60.96%"},{"v":4950,"d":"4,950"},{"v":0.9196428571428571,"d":"91.96%"},0,4]
["CTS",15016,"Environmental Monitoring Car","On Going","CTS/E","Fan Chenxi","Fan Chenxi","2015-01-13","00:00:00","00:00:00","00:00:00","N","ZNIC.008204","NZNIC015016K",null,15016,{"v":4000000,"d":"4,000,000"},{"v":0,"d":"0 "},{"v":4542735,"d":"4,542,735 "},{"v":3215625.56,"d":"3,215,626 "},{"v":22568213.5,"d":"22,568,214 "},{"v":0,"d":"0 "},0,{"v":4000000,"d":"4,000,000"},{"v":-20968839.049999997,"d":"-20,968,839"},{"v":-815000.0099999998,"d":"-815,000"},{"v":4000000,"d":"4,000,000"},{"v":4815000.010000002,"d":"4,815,000"},{"v":0.20375000250000042,"d":"20.38%"},{"v":3215625.56,"d":"3,215,626"},{"v":22568213.5,"d":"22,568,214"},0,{"v":-20968839.049999997,"d":"-20,968,839"},{"v":0.1811111133333333,"d":"18.11%"},{"$error":"#DIV/0!"},0,{"$error":"#DIV/0!"},0,{"$error":"#DIV/0!"},0,0]
["CEP/L",15014,"PS A915 Emergency Lighting and Fire Alarm System Modification","Completed","CTE/A","Xu Zheng","Zhang Pu","2015-03-04","2015-09-22","00:00:00","00:00:00","N","ZNIF.175410.15.01","NZNIC015014K",null,15014,{"v":434000,"d":"434,000"},{"v":0,"d":"0 "},{"v":474825,"d":"474,825 "},{"v":738775.88,"d":"738,776 "},{"v":178940,"d":"178,940 "},{"v":12220,"d":"12,220 "},{"v":30050,"d":"30,050"},{"v":434000,"d":"434,000"},"0",{"v":-31728.639999999956,"d":"-31,729"},{"v":434000,"d":"434,000"},{"v":927715.88,"d":"927,716"},{"v":1.137594193548387,"d":"113.76%"},{"v":738775.88,"d":"738,776"},{"v":178940,"d":"178,940"},{"v":10000,"d":"10,000"},"0",{"v":0.2851557400028738,"d":"28.52%"},{"v":-0.022250304735114954,"d":"-2.23%"},{"v":12220,"d":"12,220"},{"v":0.8433333333333334,"d":"84.33%"},{"v":30050,"d":"30,050"},{"v":0.6196202531645569,"d":"61.96%"},0,0]
["CTM",15011,"Modification for Main Door of Spare Parts Warehouse","On Going","CTE/C","Yu Yi","Xu Zhaofeng","2015-07-31","00:00:00","00:00:00","00:00:00","N","ZNIF.641330.15.02","NZNIC015011K",null,15011,{"v":384000,"d":"384,000"},{"v":0,"d":"0 "},{"v":626000,"d":"626,000 "},{"v":0,"d":"0 "},{"v":0,"d":"0 "},{"v":46480,"d":"46,480 "},{"v":43000,"d":"43,000"},{"v":384000,"d":"384,000"},{"v":306520,"d":"306,520"},{"v":-12000,"d":"-12,000"},{"v":384000,"d":"384,000"},{"v":306520,"d":"306,520"},{"v":-0.20177083333333334,"d":"-20.18%"},0,0,0,{"v":306520,"d":"306,520"},{"v":0.05217391304347826,"d":"5.22%"},{"$error":"#DIV/0!"},{"v":46480,"d":"46,480"},{"v":0.1230188679245283,"d":"12.30%"},{"v":43000,"d":"43,000"},{"v":0,"d":"0.00%"},0,0]
["COA/E",15010,"Replace the Material of P7120A/B by PFA","On Going","CTE/P","Xu Jin","Wu Zefei","2015-08-10","00:00:00","00:00:00","00:00:00","T","ZNIF.106200.15.01","NZNIC015010K",null,15010,{"v":495000,"d":"495,000"},{"v":0,"d":"0 "},{"v":722707,"d":"722,707 "},{"v":0,"d":"0 "},{"v":0,"d":"0 "},{"v":51995,"d":"51,995 "},{"v":54450,"d":"54,450"},{"v":495000,"d":"495,000"},{"v":374972.14,"d":"374,972"},{"v":13582.859999999986,"d":"13,583"},{"v":495000,"d":"495,000"},{"v":374972.14,"d":"374,972"},{"v":-0.24248052525252523,"d":"-24.25%"},0,0,0,{"v":374972.14,"d":"374,972"},{"v":-0.04851021428571423,"d":"-4.85%"},{"$error":"#DIV/0!"},{"v":51995,"d":"51,995"},{"v":0.4747979797979798,"d":"47.48%"},{"v":54450,"d":"54,450"},{"v":0.01,"d":"1.00%"},0,0]
["CEP/E",15009,"Modify Suction Side of P4330","On Going","CTE/P","Gu Jingfeng","Wu Zefei","2015-05-15","00:00:00","00:00:00","00:00:00","T","ZNIF.105700.15.01","NZNIC015009K",null,15009,{"v":590000,"d":"590,000"},{"v":0,"d":"0 "},{"v":672139,"d":"672,139 "},{"v":0,"d":"0 "},{"v":0,"d":"0 "},{"v":47245,"d":"47,245 "},{"v":75600,"d":"75,600"},{"v":590000,"d":"590,000"},{"v":410021.97,"d":"410,022"},{"v":57133.03,"d":"57,133"},{"v":590000,"d":"590,000"},{"v":410021.97,"d":"410,022"},{"v":-0.30504750847457635,"d":"-30.50%"},0,0,0,{"v":410021.97,"d":"410,022"},{"v":-0.2789726654978724,"d":"-27.90%"},{"$error":"#DIV/0!"},{"v":47245,"d":"47,245"},{"v":0.70471875,"d":"70.47%"},{"v":75600,"d":"75,600"},{"v":0.055,"d":"5.50%"},0,0]
["COA/A",15004,"Revamp HVAC System in B550 Control Building","Completed","CTE/C","Gao Feng","Wang Wei","2015-05-07","2015-09-06","00:00:00","00:00:00","H","ZNIC.009265","NZNIC015004K",null,15004,{"v":1564000,"d":"1,564,000"},{"v":0,"d":"0 "},{"v":1577128,"d":"1,577,128 "},{"v":437641.21,"d":"437,641 "},{"v":0,"d":"0 "},{"v":70660,"d":"70,660 "},{"v":33550,"d":"33,550"},{"v":1564000,"d":"1,564,000"},"0",{"v":223669.20000000004,"d":"223,669"},{"v":1564000,"d":"1,564,000"},{"v":445641.21,"d":"445,641"},{"v":-0.7150631649616368,"d":"-71.51%"},{"v":437641.21,"d":"437,641"},0,{"v":8000,"d":"8,000"},"0",{"v":-0.2191479443225687,"d":"-21.91%"},{"v":-0.04829038599582354,"d":"-4.83%"},{"v":70660,"d":"70,660"},{"v":0.565970515970516,"d":"56.60%"},{"v":33550,"d":"33,550"},{"v":0.5234375,"d":"52.34%"},0,1]
["CBP/C",14313,"Replace Existing Electrical Heater H-520","On Going","CTE/A","Hu Xiao","Chen Gang","2015-05-15","00:00:00","00:00:00","00:00:00","N","ZNIC.009347","NZNIC014313K",null,14313,{"v":1885000,"d":"1,885,000"},{"v":0,"d":"0 "},{"v":2957457,"d":"2,957,457 "},{"v":2330341.89,"d":"2,330,342 "},{"v":0,"d":"0 "},{"v":59860,"d":"59,860 "},{"v":63800,"d":"63,800"},{"v":1885000,"d":"1,885,000"},{"v":-620049.0800000001,"d":"-620,049"},{"v":51047.189999999944,"d":"51,047"},{"v":1885000,"d":"1,885,000"},{"v":1710292.81,"d":"1,710,293"},{"v":-0.09268285941644559,"d":"-9.27%"},{"v":2330341.89,"d":"2,330,342"},0,0,{"v":-620049.0800000001,"d":"-620,049"},{"v":-0.04770765420560742,"d":"-4.77%"},{"$error":"#DIV/0!"},{"v":59860,"d":"59,860"},{"v":0.49378435517970404,"d":"49.38%"},{"v":63800,"d":"63,800"},{"v":0,"d":"0.00%"},0,0]
["CBP/M",14312,"Replace Exchanger E2320 of EB/SM","Completed","CTM/M","Chu Chao","Chu Chao","2014-12-24","2015-05-30","00:00:00","00:00:00","T_2015","ZNIC.008125","NZNIC014312K",null,14312,{"v":2160000,"d":"2,160,000"},{"v":0,"d":"0 "},{"v":2160000,"d":"2,160,000 "},{"v":50805.16,"d":"50,805 "},{"v":0,"d":"0 "},{"v":13750,"d":"13,750 "},0,{"v":2160000,"d":"2,160,000"},"0",0,{"v":2160000,"d":"2,160,000"},{"v":50805.16,"d":"50,805"},{"v":-0.9764790925925926,"d":"-97.65%"},{"v":50805.16,"d":"50,805"},0,0,"0",{"$error":"#DIV/0!"},{"$error":"#DIV/0!"},{"v":13750,"d":"13,750"},{"v":0,"d":"0.00%"},0,{"$error":"#DIV/0!"},0,0]
["CEP/E",14311,"Change New C2450/CX2450/E1250A/E1250B/E1252","Completed","CTM/E","Wang Zhigao","Wang Zhigao","2014-12-24","2015-05-04","00:00:00","00:00:00","T_2015","ZNIC.008124","NZNIC014311K",null,14311,{"v":1675000,"d":"1,675,000"},{"v":487000,"d":"487,000 "},{"v":2061290,"d":"2,061,290 "},{"v":316000,"d":"316,000 "},{"v":0,"d":"0 "},{"v":8000,"d":"8,000 "},{"v":8000,"d":"8,000"},{"v":1675000,"d":"1,675,000"},"0",0,{"v":2162000,"d":"2,162,000"},{"v":316000,"d":"316,000"},{"v":-0.8538390379278445,"d":"-85.38%"},{"v":316000,"d":"316,000"},0,0,"0",{"$error":"#DIV/0!"},{"$error":"#DIV/0!"},{"v":8000,"d":"8,000"},{"v":0,"d":"0.00%"},{"v":8000,"d":"8,000"},{"v":0,"d":"0.00%"},0,0]
["COA/S",14309,"Add Extrusion Step for New Product AGM7","On Going","CTE/P","Zhu Jianxin","Cao Yongbin","2015-04-02","00:00:00","00:00:00","00:00:00","H","ZNIC.008120","NZNIC014309K",null,14309,{"v":27782000,"d":"27,782,000"},{"v":0,"d":"0 "},{"v":51729014,"d":"51,729,014 "},{"v":1034115.29,"d":"1,034,115 "},{"v":9200,"d":"9,200 "},{"v":144197.92000000004,"d":"144,198 "},{"v":1280575,"d":"1,280,575"},{"v":27782000,"d":"27,782,000"},{"v":21740300.810000002,"d":"21,740,301"},{"v":1880610.9799999958,"d":"1,880,611"},{"v":27782000,"d":"27,782,000"},{"v":24476616.1,"d":"24,476,616"},{"v":-0.11897573608811456,"d":"-11.90%"},{"v":1034115.29,"d":"1,034,115"},{"v":9200,"d":"9,200"},{"v":1693000,"d":"1,693,000"},{"v":21740300.810000002,"d":"21,740,301"},{"v":-0.07533359291496114,"d":"-7.53%"},{"v":-0.17610656495607957,"d":"-17.61%"},{"v":144197.92000000004,"d":"144,198"},{"v":0.8690002997955939,"d":"86.90%"},{"v":1280575,"d":"1,280,575"},{"v":0.08936888888888889,"d":"8.94%"},0,3]
["CBP/M",14308,"Modification of EB/SM Cooling Water Pumps","On Going","CTE/P","Wang Lifen","Ling Taizhong","2015-04-13","00:00:00","00:00:00","00:00:00","N","ZNIC.009023","NZNIC014308K",null,14308,{"v":1357000,"d":"1,357,000"},{"v":0,"d":"0 "},{"v":1673033,"d":"1,673,033 "},{"v":264528.16,"d":"264,528 "},{"v":835675.21,"d":"835,675 "},{"v":-1025,"d":"(1,025)"},{"v":57725,"d":"57,725"},{"v":1357000,"d":"1,357,000"},{"v":-118350.30999999982,"d":"-118,350"},{"v":79388.93999999994,"d":"79,389"},{"v":1357000,"d":"1,357,000"},{"v":1219886.06,"d":"1,219,886"},{"v":-0.10104196020633746,"d":"-10.10%"},{"v":264528.16,"d":"264,528"},{"v":835675.21,"d":"835,675"},{"v":238033,"d":"238,033"},{"v":-118350.30999999982,"d":"-118,350"},{"v":-0.07535267401631598,"d":"-7.54%"},{"$error":"#DIV/0!"},0,{"v":1.0076492537313433,"d":"100.76%"},{"v":57725,"d":"57,725"},{"v":0.5724074074074074,"d":"57.24%"},0,2]
["CBP/M",14307,"Replacement of F2404","Completed","CTM/M","Chu Chao","Chu Chao","2014-12-19","2015-05-30","00:00:00","00:00:00","T_2015","ZNIF.104400.14.04","NZNIC014307K",null,14307,{"v":192000,"d":"192,000"},{"v":0,"d":"0 "},{"v":192000,"d":"192,000 "},{"v":23850.88,"d":"23,851 "},{"v":0,"d":"0 "},{"v":8000,"d":"8,000 "},0,{"v":192000,"d":"192,000"},"0",0,{"v":192000,"d":"192,000"},{"v":23850.88,"d":"23,851"},{"v":-0.8757766666666666,"d":"-87.58%"},{"v":23850.88,"d":"23,851"},0,0,"0",{"$error":"#DIV/0!"},{"$error":"#DIV/0!"},{"v":8000,"d":"8,000"},{"v":0,"d":"0.00%"},0,{"$error":"#DIV/0!"},0,0]
["CBP/M",14306,"Replacement of F2406","Completed","CTM/M","Chu Chao","Chu Chao","2014-12-19","2015-05-01","00:00:00","00:00:00","T_2015","ZNIF.104400.14.03","NZNIC014306K",null,14306,{"v":210000,"d":"210,000"},{"v":0,"d":"0 "},{"v":210000,"d":"210,000 "},{"v":1400892.44,"d":"1,400,892 "},{"v":215773.95,"d":"215,774 "},{"v":8000,"d":"8,000 "},0,{"v":210000,"d":"210,000"},"0",0,{"v":210000,"d":"210,000"},{"v":1616666.39,"d":"1,616,666"},{"v":6.698411380952381,"d":"669.84%"},{"v":1400892.44,"d":"1,400,892"},{"v":215773.95,"d":"215,774"},0,"0",{"$error":"#DIV/0!"},{"$error":"#DIV/0!"},{"v":8000,"d":"8,000"},{"v":0,"d":"0.00%"},0,{"$error":"#DIV/0!"},0,0]
["CBP/M",14305,"Replacement of E1203","Completed","CTM/M","Chu Chao","Chu Chao","2014-12-18","2015-05-31","00:00:00","00:00:00","T_2015","ZNIF.104400.14.02","NZNIC014305K",null,14305,{"v":224000,"d":"224,000"},{"v":0,"d":"0 "},{"v":224000,"d":"224,000 "},{"v":13055,"d":"13,055 "},{"v":31203.68,"d":"31,204 "},{"v":8000,"d":"8,000 "},0,{"v":224000,"d":"224,000"},"0",0,{"v":224000,"d":"224,000"},{"v":44258.68,"d":"44,259"},{"v":-0.8024166071428571,"d":"-80.24%"},{"v":13055,"d":"13,055"},{"v":31203.68,"d":"31,204"},0,"0",{"$error":"#DIV/0!"},{"$error":"#DIV/0!"},{"v":8000,"d":"8,000"},{"v":0,"d":"0.00%"},0,{"$error":"#DIV/0!"},0,0]
["COA/A",14296,"Install Filters at Outlet of P9326/P9526","Completed","CTE/P","Xu Jin","Wu Zefei","2015-04-02","2015-12-04","00:00:00","00:00:00","N","ZNIF.106600.15.01","NZNIC014296K",null,14296,{"v":830000,"d":"830,000"},{"v":0,"d":"0 "},{"v":955432,"d":"955,432 "},{"v":2906231.59,"d":"2,906,232 "},{"v":0,"d":"0 "},{"v":25465,"d":"25,465 "},{"v":-20175,"d":"-20,175"},{"v":830000,"d":"830,000"},{"v":-2454155.23,"d":"-2,454,155"},{"v":255348.64,"d":"255,349"},{"v":830000,"d":"830,000"},{"v":549186.3599999999,"d":"549,186"},{"v":-0.3383296867469881,"d":"-33.83%"},{"v":2906231.59,"d":"2,906,232"},0,{"v":97110,"d":"97,110"},{"v":-2454155.23,"d":"-2,454,155"},{"v":-0.45677774476508665,"d":"-45.68%"},{"v":-0.15596779888425957,"d":"-15.60%"},{"v":25465,"d":"25,465"},{"v":0.8324671052631579,"d":"83.25%"},0,{"v":1.3011194029850746,"d":"130.11%"},0,0]
["CBP/M",14288,"T2401 Replace Structure Packing of EB/SM","Completed","CTM/M","Chu Chao","Chu Chao","2014-12-01","2015-05-31","00:00:00","00:00:00","T_2015","ZNIC.007947","NZNIC014288K",null,14288,{"v":2645000,"d":"2,645,000"},{"v":0,"d":"0 "},{"v":2645000,"d":"2,645,000 "},{"v":839245.53,"d":"839,246 "},{"v":649.57,"d":"650 "},{"v":13750,"d":"13,750 "},{"v":27500,"d":"27,500"},{"v":2645000,"d":"2,645,000"},"0",{"v":177495.99000000022,"d":"177,496"},{"v":2645000,"d":"2,645,000"},{"v":839895.1,"d":"839,895"},{"v":-0.6824593194706994,"d":"-68.25%"},{"v":839245.53,"d":"839,246"},{"v":649.57,"d":"650"},0,"0",{"v":-0.06112129286679466,"d":"-6.11%"},{"$error":"#DIV/0!"},{"v":13750,"d":"13,750"},{"v":0,"d":"0.00%"},{"v":27500,"d":"27,500"},{"v":0,"d":"0.00%"},0,0]
["CEP/P",14287,"Add a Differential Pressure Transmitter in Control Room","Completed","CTE/A","Xu Ge","Li Xueyong","2015-01-07","2015-06-19","00:00:00","00:00:00","N","ZNIF.678152.15.01","NZNIC014287K",null,14287,{"v":104000,"d":"104,000"},{"v":0,"d":"0 "},{"v":105300,"d":"105,300 "},{"v":0,"d":"0 "},{"v":80000,"d":"80,000 "},{"v":2471.779999999999,"d":"2,472 "},{"v":4300,"d":"4,300"},{"v":104000,"d":"104,000"},"0",{"v":2327.8700000000003,"d":"2,328"},{"v":104000,"d":"104,000"},{"v":80000,"d":"80,000"},{"v":-0.23076923076923078,"d":"-23.08%"},0,{"v":80000,"d":"80,000"},0,"0",{"v":-0.14294875,"d":"-14.29%"},{"v":-0.24258090946333474,"d":"-24.26%"},{"v":2471.779999999999,"d":"2,472"},{"v":0.922756875,"d":"92.28%"},{"v":4300,"d":"4,300"},{"v":0.8130434782608695,"d":"81.30%"},0,1]
["CBP/M",14286,"Change Gas Chromatograph A24201 to New Type","On Going","CTA/S","Li Huaxin","Li Huaxin","2014-11-27","00:00:00","00:00:00","00:00:00","N","ZNIF.104400.14.01","NZNIC014286K",null,14286,{"v":480000,"d":"480,000"},{"v":0,"d":"0 "},{"v":480000,"d":"480,000 "},{"v":0,"d":"0 "},{"v":0,"d":"0 "},{"v":2000,"d":"2,000 "},{"v":4000,"d":"4,000"},{"v":480000,"d":"480,000"},{"v":373720,"d":"373,720"},{"v":100280,"d":"100,280"},{"v":480000,"d":"480,000"},{"v":373720,"d":"373,720"},{"v":-0.22141666666666668,"d":"-22.14%"},0,0,0,{"v":373720,"d":"373,720"},{"v":-0.21336170212765956,"d":"-21.34%"},{"$error":"#DIV/0!"},{"v":2000,"d":"2,000"},{"v":0,"d":"0.00%"},{"v":4000,"d":"4,000"},{"v":0,"d":"0.00%"},0,0]
["CTS/U",14275,"Add Flowmeter on Main Pipeline for HPNG","Completed","CTE/A","Wang Zhen","Wang Xinwu","2014-12-24","2015-12-14","00:00:00","00:00:00","T_2015","ZNIC.008123","NZNIC014275K",null,14275,{"v":1151000,"d":"1,151,000"},{"v":0,"d":"0 "},{"v":1141315,"d":"1,141,315 "},{"v":835841.68,"d":"835,842 "},{"v":23515.86,"d":"23,516 "},{"v":-41380,"d":"(41,380)"},{"v":-137100.49000000002,"d":"-137,100"},{"v":1151000,"d":"1,151,000"},{"v":178983.67000000007,"d":"178,984"},{"v":32658.78999999989,"d":"32,659"},{"v":1151000,"d":"1,151,000"},{"v":1118341.2100000002,"d":"1,118,341"},{"v":-0.02837427454387472,"d":"-2.84%"},{"v":835841.68,"d":"835,842"},{"v":23515.86,"d":"23,516"},{"v":80000,"d":"80,000"},{"v":178983.67000000007,"d":"178,984"},{"v":-0.043350123686585126,"d":"-4.34%"},{"v":-0.00604116660063866,"d":"-0.60%"},0,{"v":1.4649438202247191,"d":"146.49%"},0,{"v":2.4741988172043015,"d":"247.42%"},0,3]
["CBP/C",14262,"Revamp HVAC System in BCC Control Building","Completed","CTE/C","Gao Feng","Wang Wei","2015-05-07","2015-09-29","00:00:00","00:00:00","H","ZNIC.009263","NZNIC014262K",null,14262,{"v":1216000,"d":"1,216,000"},{"v":0,"d":"0 "},{"v":2093170,"d":"2,093,170 "},{"v":349453.42,"d":"349,453 "},{"v":0,"d":"0 "},{"v":-91445,"d":"(91,445)"},{"v":35750,"d":"35,750"},{"v":1216000,"d":"1,216,000"},"0",{"v":-39482.039999999666,"d":"-39,482"},{"v":1216000,"d":"1,216,000"},{"v":388648.42,"d":"388,648"},{"v":-0.6803878125,"d":"-68.04%"},{"v":349453.42,"d":"349,453"},0,{"v":39195,"d":"39,195"},"0",{"v":0.036541709212053214,"d":"3.65%"},{"v":-0.06237254901960791,"d":"-6.24%"},0,{"v":4.13704974271012,"d":"413.70%"},{"v":35750,"d":"35,750"},{"v":0.29347826086956524,"d":"29.35%"},0,0]
["CGA",14255,"Add a Pair of Card Reader on the West Side Door of Visitor Center for Personnel Access Control","Completed","CTA/S","Dai Xiaolong","Qiu Wei","2014-10-29","2015-04-30","00:00:00","00:00:00","N","ZNIF.632000.14.01","NZNIC014255K",null,14255,{"v":35000,"d":"35,000"},{"v":0,"d":"0 "},{"v":35000,"d":"35,000 "},{"v":16500,"d":"16,500 "},{"v":0,"d":"0 "},{"v":-7900,"d":"(7,900)"},{"v":4899.25,"d":"4,899"},{"v":35000,"d":"35,000"},"0",{"v":4790.92,"d":"4,791"},{"v":35000,"d":"35,000"},{"v":16500,"d":"16,500"},{"v":-0.5285714285714286,"d":"-52.86%"},{"v":16500,"d":"16,500"},0,0,"0",{"v":0.005001250000000027,"d":"0.50%"},{"v":-0.40561964735516376,"d":"-40.56%"},0,{"v":4.95,"d":"495.00%"},{"v":4899.25,"d":"4,899"},{"v":0.18345833333333333,"d":"18.35%"},0,1]
["COO/C",14252,"Supply DMA from C1 Plant to BSNJ","Completed","CTE/P","Sun Duoxun/Liu Xiaoli","Xu Yefeng","2014-12-22","2015-08-30","00:00:00","00:00:00","T_2015","ZNIC.008115","NZNIC014252K",null,14252,{"v":1767000,"d":"1,767,000"},{"v":0,"d":"0 "},{"v":2019104,"d":"2,019,104 "},{"v":309794.94,"d":"309,795 "},{"v":1500,"d":"1,500 "},{"v":-16820,"d":"(16,820)"},{"v":-174931.56,"d":"-174,932"},{"v":1767000,"d":"1,767,000"},"0",{"v":328005.39,"d":"328,005"},{"v":1767000,"d":"1,767,000"},{"v":321294.94,"d":"321,295"},{"v":-0.8181692473118279,"d":"-81.82%"},{"v":309794.94,"d":"309,795"},{"v":1500,"d":"1,500"},{"v":10000,"d":"10,000"},"0",{"v":-0.2362425673159533,"d":"-23.62%"},{"v":-0.22417318775295136,"d":"-22.42%"},0,{"v":1.0832673267326733,"d":"108.33%"},0,{"v":1.8659978217821782,"d":"186.60%"},0,1]
["CBL/O",14251,"Build a Operation Rest Room for ACN Loading Station","On Going","CTE/C","Yu Yi","Xu Zhaofeng","2015-08-06","00:00:00","00:00:00","00:00:00","N","ZNIF.412790.15.01","NZNIC014251K",null,14251,{"v":338000,"d":"338,000"},{"v":0,"d":"0 "},{"v":395234,"d":"395,234 "},{"v":865494.28,"d":"865,494 "},{"v":0,"d":"0 "},{"v":47195,"d":"47,195 "},{"v":44000,"d":"44,000"},{"v":338000,"d":"338,000"},{"v":-639874.3,"d":"-639,874"},{"v":-4844.98,"d":"-4,845"},{"v":338000,"d":"338,000"},{"v":251649.97999999998,"d":"251,650"},{"v":-0.25547343195266276,"d":"-25.55%"},{"v":865494.28,"d":"865,494"},0,{"v":26030,"d":"26,030"},{"v":-639874.3,"d":"-639,874"},{"v":0.18250656951023997,"d":"18.25%"},{"$error":"#DIV/0!"},{"v":47195,"d":"47,195"},{"v":0.25087301587301586,"d":"25.09%"},{"v":44000,"d":"44,000"},{"v":0,"d":"0.00%"},0,0]
["CBP/C",14243,"Add a C5 Raffinate Pipe from YUANGANG Company to C5 Hydrogenation Reactor","Completed","CTE/P","Cao Lin","Ling Taizhong","2015-03-26","2015-09-06","00:00:00","00:00:00","N","ZNIC.008902","NZNIC014243K",null,14243,{"v":3720000,"d":"3,720,000"},{"v":0,"d":"0 "},{"v":3777568,"d":"3,777,568 "},{"v":1065641.62,"d":"1,065,642 "},{"v":17.09,"d":"17 "},{"v":7345,"d":"7,345 "},{"v":-56535.90000000002,"d":"-56,536"},{"v":3720000,"d":"3,720,000"},"0",{"v":1988.579999999638,"d":"1,989"},{"v":3720000,"d":"3,720,000"},{"v":1123226.7100000002,"d":"1,123,227"},{"v":-0.6980573360215054,"d":"-69.81%"},{"v":1065641.62,"d":"1,065,642"},{"v":17.09,"d":"17"},{"v":57568,"d":"57,568"},"0",{"v":0.015619021102924045,"d":"1.56%"},{"v":-0.1434913509009737,"d":"-14.35%"},{"v":7345,"d":"7,345"},{"v":0.9744076655052265,"d":"97.44%"},0,{"v":1.1667725663716815,"d":"116.68%"},0,0]
["COA/L",14240,"Recover the BA Railway Loading Station","Completed","CTE/P","Zhu Jianxin","Wu Zefei","2014-12-22","2015-11-06","00:00:00","00:00:00","H","ZNIC.008121","NZNIC014240K",null,14240,{"v":1907000,"d":"1,907,000"},{"v":0,"d":"0 "},{"v":2176992,"d":"2,176,992 "},{"v":782229.91,"d":"782,230 "},{"v":8800,"d":"8,800 "},{"v":50540,"d":"50,540 "},{"v":45655.5,"d":"45,656"},{"v":1907000,"d":"1,907,000"},{"v":822860.85,"d":"822,861"},{"v":-8428.260000000082,"d":"-8,428"},{"v":1907000,"d":"1,907,000"},{"v":1819232.76,"d":"1,819,233"},{"v":-0.04602372312532774,"d":"-4.60%"},{"v":782229.91,"d":"782,230"},{"v":8800,"d":"8,800"},{"v":205342,"d":"205,342"},{"v":822860.85,"d":"822,861"},{"v":0.05375047337233361,"d":"5.38%"},{"v":-0.25576874999999993,"d":"-25.58%"},{"v":50540,"d":"50,540"},{"v":0.8410691823899371,"d":"84.11%"},{"v":45655.5,"d":"45,656"},{"v":0.7717225,"d":"77.17%"},0,0]
["CEP/E",14237,"LP Steam Rational Distribution and Utilization","On Going","CTE/P","Gu Jingfeng","Wu Zefei","2015-11-20","00:00:00","00:00:00","00:00:00","N","ZNIC.011039","NZNIC014237K",null,14237,{"v":1763000,"d":"1,763,000"},{"v":0,"d":"0 "},{"v":1843000,"d":"1,843,000 "},{"v":157996.89,"d":"157,997 "},{"v":794908.22,"d":"794,908 "},{"v":258200,"d":"258,200 "},{"v":303050,"d":"303,050"},{"v":1763000,"d":"1,763,000"},{"v":248844.8899999999,"d":"248,845"},0,{"v":1763000,"d":"1,763,000"},{"v":1201750,"d":"1,201,750"},{"v":-0.3183494044242768,"d":"-31.83%"},{"v":157996.89,"d":"157,997"},{"v":794908.22,"d":"794,908"},0,{"v":248844.8899999999,"d":"248,845"},{"$error":"#DIV/0!"},{"$error":"#DIV/0!"},{"v":258200,"d":"258,200"},{"v":0.008448540706605223,"d":"0.84%"},{"v":303050,"d":"303,050"},{"v":0.021314387211367674,"d":"2.13%"},0,0]
["CEP/S",14235,"Add Safety Facilities for PS Burner Unit","On Going","CTE/A","Xiao Lixuan","Li Xueyong","2015-11-18","00:00:00","00:00:00","00:00:00","N","ZNIF.105400.15.02","NZNIC014235K",null,14235,{"v":439000,"d":"439,000"},{"v":0,"d":"0 "},{"v":439000,"d":"439,000 "},{"v":102570.04,"d":"102,570 "},{"v":301.3,"d":"301 "},{"v":87000,"d":"87,000 "},{"v":49100,"d":"49,100"},{"v":439000,"d":"439,000"},{"v":200028.66000000003,"d":"200,029"},0,{"v":439000,"d":"439,000"},{"v":302900,"d":"302,900"},{"v":-0.3100227790432802,"d":"-31.00%"},{"v":102570.04,"d":"102,570"},{"v":301.3,"d":"301"},0,{"v":200028.66000000003,"d":"200,029"},{"$error":"#DIV/0!"},{"$error":"#DIV/0!"},{"v":87000,"d":"87,000"},{"v":0,"d":"0.00%"},{"v":49100,"d":"49,100"},{"v":0.16779661016949152,"d":"16.78%"},0,0]
["CAP/E",14234,"Add Anti-backflow facilities at LP Steam Header of MA/BA Plant","Completed","CTE/P","Zhu Jianxin","Wu Zefei","2014-12-10","2015-04-30","00:00:00","00:00:00","T_2015","ZNIF.106300.14.01","NZNIC014234K",null,14234,{"v":893000,"d":"893,000"},{"v":0,"d":"0 "},{"v":918516,"d":"918,516 "},{"v":253601.42,"d":"253,601 "},{"v":24000,"d":"24,000 "},{"v":-31445,"d":"(31,445)"},{"v":-12263,"d":"-12,263"},{"v":893000,"d":"893,000"},"0",{"v":298340.62,"d":"298,341"},{"v":893000,"d":"893,000"},{"v":277601.42000000004,"d":"277,601"},{"v":-0.6891361478163494,"d":"-68.91%"},{"v":253601.42,"d":"253,601"},{"v":24000,"d":"24,000"},0,"0",{"v":-0.366418623519225,"d":"-36.64%"},{"v":-0.18890871245911395,"d":"-18.89%"},0,{"v":1.2002866242038217,"d":"120.03%"},0,{"v":1.1085221238938052,"d":"110.85%"},0,0]
["COA/E",14232,"Change the Breath Valve and Add a PSV for T9668","Completed","CTE/P","Xu Jin","Wang Yuncai","2014-11-20","2015-08-19","00:00:00","00:00:00","N","ZNIF.106700.14.01","NZNIC014232K",null,14232,{"v":320000,"d":"320,000"},{"v":0,"d":"0 "},{"v":349453,"d":"349,453 "},{"v":153369.21,"d":"153,369 "},{"v":0,"d":"0 "},{"v":-63340,"d":"(63,340)"},{"v":-38225,"d":"-38,225"},{"v":320000,"d":"320,000"},"0",{"v":-16307.599999999991,"d":"-16,308"},{"v":320000,"d":"320,000"},{"v":153369.21,"d":"153,369"},{"v":-0.52072121875,"d":"-52.07%"},{"v":153369.21,"d":"153,369"},0,0,"0",{"v":0.1092752600989924,"d":"10.93%"},{"v":-0.10799633986928106,"d":"-10.80%"},0,{"$error":"#DIV/0!"},0,{"$error":"#DIV/0!"},0,0]
["CAP/L",14230,"Add a Shed for A455 Truck Parking Lot","On Going","CTE/C","Yu Yi","Lu Jie","2015-09-09","00:00:00","00:00:00","00:00:00","N","ZNIC.010285","NZNIC014230K",null,14230,{"v":1410000,"d":"1,410,000"},{"v":0,"d":"0 "},{"v":1524250,"d":"1,524,250 "},{"v":0,"d":"0 "},{"v":152807.8,"d":"152,808 "},{"v":64900,"d":"64,900 "},{"v":71500,"d":"71,500"},{"v":1410000,"d":"1,410,000"},{"v":776006.19,"d":"776,006"},{"v":226440.01,"d":"226,440"},{"v":1410000,"d":"1,410,000"},{"v":1047159.99,"d":"1,047,160"},{"v":-0.2573333404255319,"d":"-25.73%"},0,{"v":152807.8,"d":"152,808"},{"v":118346,"d":"118,346"},{"v":776006.19,"d":"776,006"},{"v":-0.47175002083333334,"d":"-47.18%"},{"$error":"#DIV/0!"},{"v":64900,"d":"64,900"},{"v":0.24115755627009647,"d":"24.12%"},{"v":71500,"d":"71,500"},{"v":0.2777777777777778,"d":"27.78%"},0,2]
["CEP/L",14227,"Rebuild the Existing Holding Device in PS Packing","Completed","CTE/P","Ding Juntao","Wang Yuncai","2014-12-04","2015-06-29","00:00:00","00:00:00","N","ZNIF.175410.14.01","NZNIC014227K",null,14227,{"v":350000,"d":"350,000"},{"v":0,"d":"0 "},{"v":354290,"d":"354,290 "},{"v":4854302.86,"d":"4,854,303 "},{"v":699145.51,"d":"699,146 "},{"v":-4602.979999999996,"d":"(4,603)"},{"v":8150,"d":"8,150"},{"v":350000,"d":"350,000"},"0",{"v":-20166.780000000013,"d":"-20,167"},{"v":350000,"d":"350,000"},{"v":5555048.37,"d":"5,555,048"},{"v":14.871566771428572,"d":"1487.16%"},{"v":4854302.86,"d":"4,854,303"},{"v":699145.51,"d":"699,146"},{"v":1600,"d":"1,600"},"0",{"v":0.11964151368473204,"d":"11.96%"},{"v":-0.23552076242341735,"d":"-23.55%"},0,{"v":1.0605655263157894,"d":"106.06%"},{"v":8150,"d":"8,150"},{"v":0.8188888888888889,"d":"81.89%"},0,2]
["CBL/O",14226,"Add a Unloading System for PALD in B305 Loading Station","Completed","CTE/P","Yu Xiya","Jiang Haijin","2014-12-03","2015-07-22","00:00:00","00:00:00","T_2015","ZNIC.007948","NZNIC014226K",null,14226,{"v":1270000,"d":"1,270,000"},{"v":0,"d":"0 "},{"v":1280313,"d":"1,280,313 "},{"v":159712.92,"d":"159,713 "},{"v":0,"d":"0 "},{"v":52634,"d":"52,634 "},{"v":-36350.119999999995,"d":"-36,350"},{"v":1270000,"d":"1,270,000"},"0",{"v":135139.00000000006,"d":"135,139"},{"v":1270000,"d":"1,270,000"},{"v":167625.92,"d":"167,626"},{"v":-0.8680110866141733,"d":"-86.80%"},{"v":159712.92,"d":"159,713"},0,{"v":7913,"d":"7,913"},"0",{"v":-0.17699879395475773,"d":"-17.70%"},{"v":-0.2522598020249621,"d":"-25.23%"},{"v":52634,"d":"52,634"},{"v":0.7680044077134986,"d":"76.80%"},0,{"v":1.2152805448623039,"d":"121.53%"},0,1]
["CBP/S",14222,"Add H2 Pipeline to BSNJ from Syngas Plant","Completed","CTE/P","Cao Lin","Ling Taizhong","2015-01-07","2015-09-30","00:00:00","00:00:00","N","ZNIC.008171","NZNIC014222K",null,14222,{"v":1130000,"d":"1,130,000"},{"v":559000,"d":"559,000 "},{"v":2285508,"d":"2,285,508 "},{"v":0,"d":"0 "},{"v":2293536.92,"d":"2,293,537 "},{"v":-95320,"d":"(95,320)"},{"v":-76293.77000000002,"d":"-76,294"},{"v":1689000,"d":"1,689,000"},"0",{"v":69393.75,"d":"69,394"},{"v":1689000,"d":"1,689,000"},{"v":2318536.92,"d":"2,318,537"},{"v":0.3727276021314387,"d":"37.27%"},0,{"v":2293536.92,"d":"2,293,537"},{"v":25000,"d":"25,000"},"0",{"v":-0.010544857467935227,"d":"-1.05%"},{"v":-0.06410582243675676,"d":"-6.41%"},0,{"v":1.5519397799652577,"d":"155.19%"},0,{"v":1.2529005386591532,"d":"125.29%"},0,1]
["CBP/S",14218,"Modify Antisurge Control System of K1401","Completed","CTA/M","Cheng Guiyou","Gan Shuangfeng","2014-08-15","2015-04-22","2015-05-04","00:00:00","T_2015","ZNIC.014218","NZNIC014218K",null,14218,{"v":1000000,"d":"1,000,000"},{"v":0,"d":"0 "},{"v":1008800,"d":"1,008,800 "},{"v":348420.96,"d":"348,421 "},{"v":0,"d":"0 "},{"v":3300,"d":"3,300 "},0,{"v":1000000,"d":"1,000,000"},"0",{"v":44791.01000000001,"d":"44,791"},{"v":1000000,"d":"1,000,000"},{"v":348420.96,"d":"348,421"},{"v":-0.65157904,"d":"-65.16%"},{"v":348420.96,"d":"348,421"},0,0,"0",{"v":-0.046657302083333345,"d":"-4.67%"},{"$error":"#DIV/0!"},{"v":3300,"d":"3,300"},{"v":0,"d":"0.00%"},0,{"$error":"#DIV/0!"},0,0]
["COA/A",14207,"Let-down MP Steam to LP Steam in GAA Plant","On Going","CTE/P","Zhu Jianxin","Wu Zefei","2015-09-18","00:00:00","00:00:00","00:00:00","T_2015","ZNIC.010379","NZNIC014207K",null,14207,{"v":2362000,"d":"2,362,000"},{"v":0,"d":"0 "},{"v":3206055,"d":"3,206,055 "},{"v":1591482.91,"d":"1,591,483 "},{"v":1500031.67,"d":"1,500,032 "},{"v":-119335,"d":"(119,335)"},{"v":-44890,"d":"-44,890"},{"v":2362000,"d":"2,362,000"},{"v":-1605997.59,"d":"-1,605,998"},{"v":449579.8100000003,"d":"449,580"},{"v":2362000,"d":"2,362,000"},{"v":1912420.1900000002,"d":"1,912,420"},{"v":-0.19033861558001686,"d":"-19.03%"},{"v":1591482.91,"d":"1,591,483"},{"v":1500031.67,"d":"1,500,032"},{"v":426903.2,"d":"426,903"},{"v":-1605997.59,"d":"-1,605,998"},{"v":-0.2813449724684136,"d":"-28.13%"},{"$error":"#DIV/0!"},0,{"$error":"#DIV/0!"},0,{"$error":"#DIV/0!"},0,0]
["CBP/S",14200,"Add Control Valve at 1st Stage Inlet Nitrogen Line of K1701","Completed","CTE/P","Wang Can","Ling Taizhong","2015-02-13","2014-10-20","00:00:00","00:00:00","N","ZNIF.104300.15.01","NZNIC014200K",null,14200,{"v":155000,"d":"155,000"},{"v":0,"d":"0 "},{"v":174249,"d":"174,249 "},{"v":0,"d":"0 "},{"v":0,"d":"0 "},{"v":-1445,"d":"(1,445)"},{"v":11850,"d":"11,850"},{"v":155000,"d":"155,000"},"0",{"v":15654.940000000002,"d":"15,655"},{"v":155000,"d":"155,000"},0,{"v":-1,"d":"-100.00%"},0,0,0,"0",{"v":-0.31253875233372785,"d":"-31.25%"},{"v":-0.32280907969785727,"d":"-32.28%"},0,{"v":1.0283333333333333,"d":"102.83%"},{"v":11850,"d":"11,850"},{"v":0.7109756097560975,"d":"71.10%"},0,0]
["CBL/O",14198,"Replace Manual Loading Arm Z2810&Z4802 with Pneumatic One","On Going","CTE/P","Yu Xiya","Xu Yefeng","2015-03-11","00:00:00","00:00:00","00:00:00","T","ZNIF.412740.15.01","NZNIC014198K",null,14198,{"v":440000,"d":"440,000"},{"v":0,"d":"0 "},{"v":466800,"d":"466,800 "},{"v":299849.03,"d":"299,849 "},{"v":15940.52,"d":"15,941 "},{"v":30305,"d":"30,305 "},{"v":32450,"d":"32,450"},{"v":440000,"d":"440,000"},{"v":46902.72999999997,"d":"46,903"},{"v":11752.720000000001,"d":"11,753"},{"v":440000,"d":"440,000"},{"v":365492.28,"d":"365,492"},{"v":-0.16933572727272722,"d":"-16.93%"},{"v":299849.03,"d":"299,849"},{"v":15940.52,"d":"15,941"},{"v":2800,"d":"2,800"},{"v":46902.72999999997,"d":"46,903"},{"v":-0.048815397805751046,"d":"-4.88%"},{"$error":"#DIV/0!"},{"v":30305,"d":"30,305"},{"v":0.611474358974359,"d":"61.15%"},{"v":32450,"d":"32,450"},{"v":0.2625,"d":"26.25%"},0,0]
["CBL/O",14197,"Replace Manual Loading Arm Z2203 with Pneumatic One","On Going","CTE/P","Yu Xiya","Xu Yefeng","2015-03-11","00:00:00","00:00:00","00:00:00","T","ZNIF.651010.15.01","NZNIC014197K",null,14197,{"v":273000,"d":"273,000"},{"v":0,"d":"0 "},{"v":294920,"d":"294,920 "},{"v":7147716.94,"d":"7,147,717 "},{"v":0,"d":"0 "},{"v":22215,"d":"22,215 "},{"v":31250,"d":"31,250"},{"v":273000,"d":"273,000"},{"v":-6959651.32,"d":"-6,959,651"},{"v":10269.379999999994,"d":"10,269"},{"v":273000,"d":"273,000"},{"v":209265.6200000001,"d":"209,266"},{"v":-0.23345926739926698,"d":"-23.35%"},{"v":7147716.94,"d":"7,147,717"},0,{"v":21200,"d":"21,200"},{"v":-6959651.32,"d":"-6,959,651"},{"v":-0.08390449102192167,"d":"-8.39%"},{"v":0.018819444444444382,"d":"1.88%"},{"v":22215,"d":"22,215"},{"v":0.6826428571428571,"d":"68.26%"},{"v":31250,"d":"31,250"},{"v":0.3055555555555556,"d":"30.56%"},0,0]
["COO/O",14194,"Add a Pump and Two On/off Valves for Val Loading","On Going","CTE/P","Liu Xiaoli","Jiang Haijin","2015-11-06","00:00:00","00:00:00","00:00:00","N","ZNIC.010907","NZNIC014194K",null,14194,{"v":1260000,"d":"1,260,000"},{"v":0,"d":"0 "},{"v":1412808,"d":"1,412,808 "},{"v":2649878.44,"d":"2,649,878 "},{"v":3100773.21,"d":"3,100,773 "},{"v":302500,"d":"302,500 "},{"v":238150,"d":"238,150"},{"v":1260000,"d":"1,260,000"},{"v":-5051849.19,"d":"-5,051,849"},{"v":20547.53999999998,"d":"20,548"},{"v":1260000,"d":"1,260,000"},{"v":698802.46,"d":"698,802"},{"v":-0.44539487301587305,"d":"-44.54%"},{"v":2649878.44,"d":"2,649,878"},{"v":3100773.21,"d":"3,100,773"},0,{"v":-5051849.19,"d":"-5,051,849"},{"v":-0.12683666666666654,"d":"-12.68%"},{"$error":"#DIV/0!"},{"v":302500,"d":"302,500"},{"v":0,"d":"0.00%"},{"v":238150,"d":"238,150"},{"v":0.09224318658280922,"d":"9.22%"},0,0]
["CBP/C",14187,"Add Pipeline to Send Light Fuel Oil to STT1310","On Going","CTE/P","Qiu Zhufeng","Ling Taizhong","2014-08-21","00:00:00","00:00:00","00:00:00","T_2015","ZNIC.014187","NZNIC014187K",null,14187,{"v":4207000,"d":"4,207,000"},{"v":2188000,"d":"2,188,000 "},{"v":5575289,"d":"5,575,289 "},{"v":263559.93,"d":"263,560 "},{"v":103531,"d":"103,531 "},{"v":20846.609999999986,"d":"20,847 "},{"v":-59019.28000000003,"d":"-59,019"},{"$error":"#N/A"},{"$error":"#N/A"},{"$error":"#N/A"},{"v":6395000,"d":"6,395,000"},{"$error":"#N/A"},{"$error":"#N/A"},{"v":263559.93,"d":"263,560"},{"v":103531,"d":"103,531"},{"v":39112,"d":"39,112"},{"$error":"#N/A"},{"$error":"#N/A"},{"v":-0.163453710691824,"d":"-16.35%"},{"v":20846.609999999986,"d":"20,847"},{"v":0.9001599137931036,"d":"90.02%"},0,{"v":1.1503963305090146,"d":"115.04%"},0,2]
["CEP/S",14182,"Rebuilt a Waste Liquid Storage","Completed","CTE/C","Gao Feng","Xia Weiguang","2015-05-07","2015-12-15","00:00:00","00:00:00","H","ZNIF.105400.15.01","NZNIC014182K",null,14182,{"v":748000,"d":"748,000"},{"v":0,"d":"0 "},{"v":1175500,"d":"1,175,500 "},{"v":165755.11,"d":"165,755 "},{"v":16000,"d":"16,000 "},{"v":-78032.95999999999,"d":"(78,033)"},{"v":-8650,"d":"-8,650"},{"v":748000,"d":"748,000"},{"v":289046.36,"d":"289,046"},{"v":50298.53,"d":"50,299"},{"v":748000,"d":"748,000"},{"v":697701.47,"d":"697,701"},{"v":-0.06724402406417115,"d":"-6.72%"},{"v":165755.11,"d":"165,755"},{"v":16000,"d":"16,000"},{"v":226900,"d":"226,900"},{"v":289046.36,"d":"289,046"},{"$error":"#DIV/0!"},{"v":-0.2108069153394803,"d":"-21.08%"},0,{"v":1.5911587878787878,"d":"159.12%"},0,{"v":1.1802083333333333,"d":"118.02%"},0,3]
["CTM",14173,"Technical Material Bar-code Management System","On Going","CFA/I","Tao Yang","Wang Jun","2014-06-13","00:00:00","00:00:00","00:00:00","N","ZNIC.014173","NZNIC014173K",null,14173,{"v":2580000,"d":"2,580,000"},{"v":0,"d":"0 "},{"v":4873537,"d":"4,873,537 "},{"v":15484487.68,"d":"15,484,488 "},{"v":0,"d":"0 "},{"v":0,"d":"0 "},0,{"v":2580000,"d":"2,580,000"},{"v":-12904487.68,"d":"-12,904,488"},0,{"v":2580000,"d":"2,580,000"},{"v":2580000,"d":"2,580,000"},{"v":0,"d":"0.00%"},{"v":15484487.68,"d":"15,484,488"},0,0,{"v":-12904487.68,"d":"-12,904,488"},{"$error":"#DIV/0!"},{"$error":"#DIV/0!"},0,{"$error":"#DIV/0!"},0,{"$error":"#DIV/0!"},0,0]
["CEP/E",14168,"Change an Online TOC Analyzer","On Going","CTA/S","Yong Jie","Yong Jie","2014-08-26","00:00:00","00:00:00","00:00:00","N","ZNIC.014168","NZNIC014168K",null,14168,{"v":480000,"d":"480,000"},{"v":0,"d":"0 "},{"v":480000,"d":"480,000 "},{"v":352861.92,"d":"352,862 "},{"v":2000,"d":"2,000 "},{"v":-550,"d":"(550)"},{"v":8800,"d":"8,800"},{"v":480000,"d":"480,000"},{"v":114338.08000000002,"d":"114,338"},{"v":2000,"d":"2,000"},{"v":480000,"d":"480,000"},{"v":469200,"d":"469,200"},{"v":-0.0225,"d":"-2.25%"},{"v":352861.92,"d":"352,862"},{"v":2000,"d":"2,000"},0,{"v":114338.08000000002,"d":"114,338"},{"v":-0.005,"d":"-0.50%"},{"$error":"#DIV/0!"},0,{"v":1.0714285714285714,"d":"107.14%"},{"v":8800,"d":"8,800"},{"v":0,"d":"0.00%"},0,0]
["CBP/C",14165,"Add Pipe from BYC EBO Ship Loading Pipe to YPC G102 Tank","Completed","CTE/P","Qiu Zhufeng","Ling Taizhong","2014-07-22","2015-05-27","00:00:00","00:00:00","H","ZNIC.014165","NZNIC014165K",null,14165,{"v":1143000,"d":"1,143,000"},{"v":1448000,"d":"1,448,000 "},{"v":4095032,"d":"4,095,032 "},{"v":147730.98,"d":"147,731 "},{"v":0,"d":"0 "},{"v":7680,"d":"7,680 "},{"v":-217067.97000000003,"d":"-217,068"},{"v":2591000,"d":"2,591,000"},"0",{"v":1069078.940000001,"d":"1,069,079"},{"v":2591000,"d":"2,591,000"},{"v":151730.98,"d":"151,731"},{"v":-0.9414392203782324,"d":"-94.14%"},{"v":147730.98,"d":"147,731"},0,{"v":4000,"d":"4,000"},"0",{"v":-0.42154116618616155,"d":"-42.15%"},{"v":-0.21791784198622668,"d":"-21.79%"},{"v":7680,"d":"7,680"},{"v":0.8266365688487585,"d":"82.66%"},0,{"v":2.575525095264018,"d":"257.55%"},0,5]
["CBL/O",14163,"Replacement of 3 Low Efficiency Motors in A300 & RTTF","Canceled","CTA/L","Chen Kun","Chen Kun","2014-06-13","00:00:00","00:00:00","00:00:00","N","ZNIC.014163","NZNIC014163K",null,14163,{"v":87789,"d":"87,789"},{"v":0,"d":"0 "},{"v":87789,"d":"87,789 "},{"v":180926.11,"d":"180,926 "},{"v":799388.77,"d":"799,389 "},{"v":4400,"d":"4,400 "},{"v":35000,"d":"35,000"},{"v":87789,"d":"87,789"},{"v":-931925.88,"d":"-931,926"},0,{"v":87789,"d":"87,789"},{"v":48389,"d":"48,389"},{"v":-0.4488033808335896,"d":"-44.88%"},{"v":180926.11,"d":"180,926"},{"v":799388.77,"d":"799,389"},0,{"v":-931925.88,"d":"-931,926"},{"$error":"#DIV/0!"},{"$error":"#DIV/0!"},{"v":4400,"d":"4,400"},{"v":0,"d":"0.00%"},{"v":35000,"d":"35,000"},{"v":0,"d":"0.00%"},0,0]
["CBP/C",14151,"Add New Pan Oil Pipe from Pan oil Pump to Ethylene Bottom Oil Pipe","Completed","CTE/P","Sun Aihong","Ling Taizhong","2015-01-13","2015-12-14","00:00:00","00:00:00","T_2015","ZNIF.104100.15.01","NZNIC014151K",null,14151,{"v":410000,"d":"410,000"},{"v":0,"d":"0 "},{"v":483095,"d":"483,095 "},{"v":1372804.69,"d":"1,372,805 "},{"v":82972.84,"d":"82,973 "},{"v":-1425,"d":"(1,425)"},{"v":-36825,"d":"-36,825"},{"v":410000,"d":"410,000"},{"v":-1099331.3099999998,"d":"-1,099,331"},{"v":51553.77999999998,"d":"51,554"},{"v":410000,"d":"410,000"},{"v":358446.2200000002,"d":"358,446"},{"v":-0.1257409268292678,"d":"-12.57%"},{"v":1372804.69,"d":"1,372,805"},{"v":82972.84,"d":"82,973"},{"v":2000,"d":"2,000"},{"v":-1099331.3099999998,"d":"-1,099,331"},{"v":-0.11892832065273223,"d":"-11.89%"},{"v":-0.41124890425025673,"d":"-41.12%"},0,{"v":1.0182692307692307,"d":"101.83%"},0,{"v":1.4976351351351351,"d":"149.76%"},0,0]
["All",14149,"BYC Electrical Monitoring & Control System (EMCS) Migration","Completed","CTA/VO","Gu Hemei","Sun Zhongpin","2014-06-05","2015-04-20","2015-10-29","00:00:00","T_2015","ZNIC.014149","NZNIC014149K",null,14149,{"v":9740000,"d":"9,740,000"},{"v":0,"d":"0 "},{"v":9742700,"d":"9,742,700 "},{"v":5797061.95,"d":"5,797,062 "},{"v":0,"d":"0 "},{"v":-376977.24,"d":"(376,977)"},{"v":-47306,"d":"-47,306"},{"v":9740000,"d":"9,740,000"},"0",{"v":1289086.7300000014,"d":"1,289,087"},{"v":9740000,"d":"9,740,000"},{"v":5797061.95,"d":"5,797,062"},{"v":-0.40481910164271045,"d":"-40.48%"},{"v":5797061.95,"d":"5,797,062"},0,0,"0",{"v":-0.14725482356791544,"d":"-14.73%"},{"v":-0.16389291386550056,"d":"-16.39%"},0,{"v":2.6799342245989304,"d":"267.99%"},0,{"v":1.8776623376623376,"d":"187.77%"},0,3]
["CEP/S",14144,"Add PIB Tank and Feed System in HIPS Plant","On Going","CTE/P","Gu Jingfeng","Wu Zefei","2014-12-08","00:00:00","00:00:00","00:00:00","H","ZNIC.008007","NZNIC014144K",null,14144,{"v":6240000,"d":"6,240,000"},{"v":0,"d":"0 "},{"v":10167086,"d":"10,167,086 "},{"v":1031907.57,"d":"1,031,908 "},{"v":9991.45,"d":"9,991 "},{"v":-96586.63,"d":"(96,587)"},{"v":-140434.59999999998,"d":"-140,435"},{"v":6240000,"d":"6,240,000"},{"v":4124796.0399999996,"d":"4,124,796"},{"v":165282.94000000012,"d":"165,283"},{"v":6240000,"d":"6,240,000"},{"v":6074717.06,"d":"6,074,717"},{"v":-0.026487650641025706,"d":"-2.65%"},{"v":1031907.57,"d":"1,031,908"},{"v":9991.45,"d":"9,991"},{"v":908022,"d":"908,022"},{"v":4124796.0399999996,"d":"4,124,796"},{"v":-0.028384722544031012,"d":"-2.84%"},{"v":-0.22694920502221605,"d":"-22.69%"},0,{"v":1.1856721068819684,"d":"118.57%"},0,{"v":1.3793991625016884,"d":"137.94%"},1,8]
["CBL/P",14141,"Add a Manual Sampler on the NAP Feed Piping from YPC","On Going","CTE/P","Li Shouqing","Jiang Haijin","2015-03-20","00:00:00","00:00:00","00:00:00","N","ZNIF.604170.15.01","NZNIC014141K",null,14141,{"v":497000,"d":"497,000"},{"v":0,"d":"0 "},{"v":600931,"d":"600,931 "},{"v":1005817.98,"d":"1,005,818 "},{"v":2751276.84,"d":"2,751,277 "},{"v":9805,"d":"9,805 "},{"v":24825,"d":"24,825"},{"v":497000,"d":"497,000"},{"v":-3225083.8099999996,"d":"-3,225,084"},{"v":-121441.01000000001,"d":"-121,441"},{"v":497000,"d":"497,000"},{"v":583811.0100000002,"d":"583,811"},{"v":0.1746700402414492,"d":"17.47%"},{"v":1005817.98,"d":"1,005,818"},{"v":2751276.84,"d":"2,751,277"},{"v":51800,"d":"51,800"},{"v":-3225083.8099999996,"d":"-3,225,084"},{"v":0.6897067350915485,"d":"68.97%"},{"$error":"#DIV/0!"},{"v":9805,"d":"9,805"},{"v":0.9066190476190477,"d":"90.66%"},{"v":24825,"d":"24,825"},{"v":0.6349264705882353,"d":"63.49%"},0,0]
["CBP/A",14126,"Add ESD Interlock Signal and Block Valve for 410-R101A/B","Completed","CTE/A","Gong Feibao","Li Hong","2014-08-06","2015-04-29","00:00:00","00:00:00","T_2015","ZNIC.014126","NZNIC014126K",null,14126,{"v":191000,"d":"191,000"},{"v":0,"d":"0 "},{"v":207000,"d":"207,000 "},{"v":278055.72,"d":"278,056 "},{"v":158094.74,"d":"158,095 "},{"v":-23330,"d":"(23,330)"},{"v":-4403,"d":"-4,403"},{"v":191000,"d":"191,000"},"0",{"v":7768.200000000023,"d":"7,768"},{"v":191000,"d":"191,000"},{"v":436150.45999999996,"d":"436,150"},{"v":1.2835102617801044,"d":"128.35%"},{"v":278055.72,"d":"278,056"},{"v":158094.74,"d":"158,095"},0,"0",{"v":-0.04719798269910637,"d":"-4.72%"},{"v":-0.44343521171601397,"d":"-44.34%"},0,{"v":1.831729055258467,"d":"183.17%"},0,{"v":1.1416894609814965,"d":"114.17%"},0,0]
["CBP/C",14121,"H109 Convection Section Modification","Completed","CTE/P","Zhou Yanduo","Ling Taizhong","2014-07-30","2015-05-27","2015-07-08","00:00:00","T_2015","ZNIC.014121","NZNIC014121K",null,14121,{"v":16490000,"d":"16,490,000"},{"v":0,"d":"0 "},{"v":16492000,"d":"16,492,000 "},{"v":633055.06,"d":"633,055 "},{"v":0,"d":"0 "},{"v":18180,"d":"18,180 "},{"v":-193590.95999999996,"d":"-193,591"},{"v":16490000,"d":"16,490,000"},"0",{"v":13222412.33,"d":"13,222,412"},{"v":16490000,"d":"16,490,000"},{"v":635055.06,"d":"635,055"},{"v":-0.9614884742268041,"d":"-96.15%"},{"v":633055.06,"d":"633,055"},0,{"v":2000,"d":"2,000"},"0",{"v":-0.8315529424709212,"d":"-83.16%"},{"v":0.015529772151212443,"d":"1.55%"},{"v":18180,"d":"18,180"},{"v":0.9004381161007667,"d":"90.04%"},0,{"v":1.6229797586484311,"d":"162.30%"},0,0]
["CBP/M",14115,"Replacement of 16 Low Efficiency Motors in EB/SM Plant","Completed","CTA/M","Lv Yong","Lv Yong","2014-06-18","2015-07-14","00:00:00","00:00:00","N","ZNIC.014115","NZNIC014115K",null,14115,{"v":873000,"d":"873,000"},{"v":0,"d":"0 "},{"v":875000,"d":"875,000 "},{"v":5107010.57,"d":"5,107,011 "},{"v":601121.7,"d":"601,122 "},{"v":0,"d":"0 "},{"v":138240,"d":"138,240"},{"v":873000,"d":"873,000"},"0",{"v":146828.34000000003,"d":"146,828"},{"v":873000,"d":"873,000"},{"v":5708132.2700000005,"d":"5,708,132"},{"v":5.538524936998855,"d":"553.85%"},{"v":5107010.57,"d":"5,107,011"},{"v":601121.7,"d":"601,122"},0,"0",{"v":-0.3085937915558511,"d":"-30.86%"},{"v":0.02773245901639333,"d":"2.77%"},0,{"$error":"#DIV/0!"},{"v":138240,"d":"138,240"},{"v":0.04,"d":"4.00%"},0,0]
["CHA",14112,"EPS Replacement for Z100 1st and 2nd Floor","Completed","CTE/A","Bian Jiacai","Chen Gang","2014-06-06","2015-03-31","00:00:00","00:00:00","N","ZNIC.014112","NZNIC014112K",null,14112,{"v":284000,"d":"284,000"},{"v":0,"d":"0 "},{"v":309000,"d":"309,000 "},{"v":346892.57,"d":"346,893 "},{"v":95000,"d":"95,000 "},{"v":5075,"d":"5,075 "},{"v":-10725,"d":"-10,725"},{"v":284000,"d":"284,000"},"0",{"v":74872,"d":"74,872"},{"v":284000,"d":"284,000"},{"v":466892.57,"d":"466,893"},{"v":0.6439879225352113,"d":"64.40%"},{"v":346892.57,"d":"346,893"},{"v":95000,"d":"95,000"},{"v":25000,"d":"25,000"},"0",{"v":-0.4404235294117647,"d":"-44.04%"},{"$error":"#DIV/0!"},{"v":5075,"d":"5,075"},{"v":0.8306922435362802,"d":"83.07%"},0,{"v":1.3482142857142858,"d":"134.82%"},0,0]
["CEP/S",14107,"PS/EPS Plant Emergency Lighting Modification","On Going","CTE/A","Xu Zheng","Zhang Pu","2015-07-24","00:00:00","00:00:00","00:00:00","H","ZNIC.009924","NZNIC014107K",null,14107,{"v":1329000,"d":"1,329,000"},{"v":0,"d":"0 "},{"v":2128389,"d":"2,128,389 "},{"v":412980.91,"d":"412,981 "},{"v":46000,"d":"46,000 "},{"v":-2522.6399999999994,"d":"(2,523)"},{"v":55700,"d":"55,700"},{"v":1329000,"d":"1,329,000"},{"v":222304.32000000007,"d":"222,304"},{"v":83393.27000000003,"d":"83,393"},{"v":1329000,"d":"1,329,000"},{"v":1189906.73,"d":"1,189,907"},{"v":-0.10466009781790822,"d":"-10.47%"},{"v":412980.91,"d":"412,981"},{"v":46000,"d":"46,000"},{"v":508621.5,"d":"508,622"},{"v":222304.32000000007,"d":"222,304"},{"v":-0.11706354894162377,"d":"-11.71%"},{"v":-0.05660392156862751,"d":"-5.66%"},0,{"v":1.0413547540983605,"d":"104.14%"},{"v":55700,"d":"55,700"},{"v":0.05593220338983051,"d":"5.59%"},0,2]
["COO/A",14104,"Add a Pipeline of ACN Waste Liquid to U5 Incinerator","On Going","CTE/P","Li Shouqing","Jiang Haijin","2015-01-21","00:00:00","00:00:00","00:00:00","N","ZNIC.008275","NZNIC014104K",null,14104,{"v":2063000,"d":"2,063,000"},{"v":0,"d":"0 "},{"v":2151486,"d":"2,151,486 "},{"v":1233823.67,"d":"1,233,824 "},{"v":266524.42,"d":"266,524 "},{"v":-16000,"d":"(16,000)"},{"v":-207203.71999999997,"d":"-207,204"},{"$error":"#N/A"},{"$error":"#N/A"},{"$error":"#N/A"},{"v":2063000,"d":"2,063,000"},{"$error":"#N/A"},{"$error":"#N/A"},{"v":1233823.67,"d":"1,233,824"},{"v":266524.42,"d":"266,524"},{"v":594078,"d":"594,078"},{"$error":"#N/A"},{"$error":"#N/A"},{"v":-0.19373093238495157,"d":"-19.37%"},0,{"v":1.0883977900552486,"d":"108.84%"},0,{"v":2.606230387596899,"d":"260.62%"},0,1]
["CTS/U",14101,"Replacement of ID Fans_Phase II CLWI Modification","Completed","CTE/P","Zhou Yanduo","Jiang Haijin","2014-04-28","2015-05-05","00:00:00","00:00:00","T_2015","ZNIC.014101","NZNIC014101K",null,14101,{"v":6213000,"d":"6,213,000"},{"v":0,"d":"0 "},{"v":6354998,"d":"6,354,998 "},{"v":910066.25,"d":"910,066 "},{"v":64000,"d":"64,000 "},{"v":-69218.57999999996,"d":"(69,219)"},{"v":-403842.1,"d":"-403,842"},{"v":6213000,"d":"6,213,000"},"0",{"v":-1007216.2099999997,"d":"-1,007,216"},{"v":6213000,"d":"6,213,000"},{"v":1019566.25,"d":"1,019,566"},{"v":-0.8358979156607114,"d":"-83.59%"},{"v":910066.25,"d":"910,066"},{"v":64000,"d":"64,000"},{"v":45500,"d":"45,500"},"0",{"v":0.3553655372250509,"d":"35.54%"},{"v":-0.036126935175382874,"d":"-3.61%"},0,{"v":1.1353246920821114,"d":"113.53%"},0,{"v":2.501550845882134,"d":"250.16%"},0,9]
["CBP/C",14097,"Add Fire Water Sprinkler Facilities for Pumps","Completed","CTE/P","Zhang Fanwen","Ling Taizhong","2014-07-22","2015-10-08","00:00:00","00:00:00","H","ZNIC.014097","NZNIC014097K",null,14097,{"v":1229000,"d":"1,229,000"},{"v":0,"d":"0 "},{"v":1543231,"d":"1,543,231 "},{"v":2702154.85,"d":"2,702,155 "},{"v":0,"d":"0 "},{"v":-11319.200000000012,"d":"(11,319)"},{"v":-33375.29999999999,"d":"-33,375"},{"v":1229000,"d":"1,229,000"},"0",{"v":20176.139999999898,"d":"20,176"},{"v":1229000,"d":"1,229,000"},{"v":2798546.85,"d":"2,798,547"},{"v":1.2770926362896664,"d":"127.71%"},{"v":2702154.85,"d":"2,702,155"},0,{"v":96392,"d":"96,392"},"0",{"v":-0.043069959650895134,"d":"-4.31%"},{"v":0.02406523488582641,"d":"2.41%"},0,{"v":1.0616178551986937,"d":"106.16%"},0,{"v":1.1673996238244513,"d":"116.74%"},0,1]
["CBP/C",14091,"APC Implementation and Optimization of Ethylene Unit","On Going","CTA/S","Dai Xiaolong","Dai Xiaolong","2014-03-19","00:00:00","00:00:00","00:00:00","N","ZNIC.014091","NZNIC014091K",null,14091,{"v":11000000,"d":"11,000,000"},{"v":0,"d":"0 "},{"v":13751277,"d":"13,751,277 "},{"v":111094.64,"d":"111,095 "},{"v":0,"d":"0 "},{"v":-1082605.88,"d":"(1,082,606)"},{"v":165800,"d":"165,800"},{"v":11000000,"d":"11,000,000"},{"v":10298311.889999999,"d":"10,298,312"},{"v":424793.47000000067,"d":"424,793"},{"v":11000000,"d":"11,000,000"},{"v":10409406.53,"d":"10,409,407"},{"v":-0.053690315454545515,"d":"-5.37%"},{"v":111094.64,"d":"111,095"},0,0,{"v":10298311.889999999,"d":"10,298,312"},{"v":-0.10461347337831864,"d":"-10.46%"},{"$error":"#DIV/0!"},0,{"v":4.608686266666666,"d":"460.87%"},{"v":165800,"d":"165,800"},{"v":0.44733333333333336,"d":"44.73%"},3,0]
["COO/A",14088,"Increase the Yield of Product AEEA","Completed","CTE/P","Li Shouqing","Jiang Haijin","2014-12-22","2015-10-09","00:00:00","00:00:00","T_2015","ZNIF.107830.14.01","NZNIC014088K",null,14088,{"v":494000,"d":"494,000"},{"v":0,"d":"0 "},{"v":665445,"d":"665,445 "},{"v":342262.57,"d":"342,263 "},{"v":0,"d":"0 "},{"v":-4610,"d":"(4,610)"},{"v":1925,"d":"1,925"},{"v":494000,"d":"494,000"},"0",{"v":10816.099999999999,"d":"10,816"},{"v":494000,"d":"494,000"},{"v":343612.57,"d":"343,613"},{"v":-0.304427995951417,"d":"-30.44%"},{"v":342262.57,"d":"342,263"},0,{"v":1350,"d":"1,350"},"0",{"v":0.010746800578005056,"d":"1.07%"},{"v":-0.18329217522272276,"d":"-18.33%"},0,{"v":1.037479674796748,"d":"103.75%"},{"v":1925,"d":"1,925"},{"v":0.978125,"d":"97.81%"},0,1]
["CCP/O",14087,"Add On/off Valves for HV24201/HV44201","Completed","CTE/A","Wang Zhen","Wang Xinwu","2014-06-03","2015-05-08","00:00:00","00:00:00","T_2015","ZNIC.014087","NZNIC014087K",null,14087,{"v":490000,"d":"490,000"},{"v":140000,"d":"140,000 "},{"v":634555,"d":"634,555 "},{"v":372868.19,"d":"372,868 "},{"v":0,"d":"0 "},{"v":-7700,"d":"(7,700)"},{"v":-48813.06000000001,"d":"-48,813"},{"v":490000,"d":"490,000"},"0",{"v":-194772.13,"d":"-194,772"},{"v":630000,"d":"630,000"},{"v":374368.19,"d":"374,368"},{"v":-0.40576477777777775,"d":"-40.58%"},{"v":372868.19,"d":"372,868"},0,{"v":1500,"d":"1,500"},"0",{"v":1.8186709290124499,"d":"181.87%"},{"v":-0.424264569533658,"d":"-42.43%"},0,{"v":1.0557768924302788,"d":"105.58%"},0,{"v":1.9646849802371544,"d":"196.47%"},0,2]
["CEP/P",14086,"Replacement of AMOT by Sentry System","Completed","CTE/A","Wang Zhen","Li Xueyong","2014-05-19","2015-05-07","00:00:00","00:00:00","T_2015","ZNIC.014086","NZNIC014086K",null,14086,{"v":5612000,"d":"5,612,000"},{"v":0,"d":"0 "},{"v":6213122,"d":"6,213,122 "},{"v":538736.16,"d":"538,736 "},{"v":4000,"d":"4,000 "},{"v":79750,"d":"79,750 "},{"v":40422,"d":"40,422"},{"v":5612000,"d":"5,612,000"},"0",{"v":210924.66000000061,"d":"210,925"},{"v":5612000,"d":"5,612,000"},{"v":542736.16,"d":"542,736"},{"v":-0.9032900641482537,"d":"-90.33%"},{"v":538736.16,"d":"538,736"},{"v":4000,"d":"4,000"},0,"0",{"v":-0.029661227345639616,"d":"-2.97%"},{"v":-0.2634009375352988,"d":"-26.34%"},{"v":79750,"d":"79,750"},{"v":0.6881720430107527,"d":"68.82%"},{"v":40422,"d":"40,422"},{"v":0.7123501156377868,"d":"71.24%"},0,0]
["CBP/C",14072,"Add 7 Samplers for Quench Section of Cracker","Completed","CTE/P","Qiu Zhufeng","Ling Taizhong","2014-07-22","2015-05-09","00:00:00","00:00:00","T_2015","ZNIC.014072","NZNIC014072K",null,14072,{"v":593000,"d":"593,000"},{"v":0,"d":"0 "},{"v":693000,"d":"693,000 "},{"v":139342.06,"d":"139,342 "},{"v":101839.4,"d":"101,839 "},{"v":7760,"d":"7,760 "},{"v":16329.11,"d":"16,329"},{"v":593000,"d":"593,000"},"0",{"v":-42106.55,"d":"-42,107"},{"v":593000,"d":"593,000"},{"v":241181.46,"d":"241,181"},{"v":-0.5932859021922429,"d":"-59.33%"},{"v":139342.06,"d":"139,342"},{"v":101839.4,"d":"101,839"},0,"0",{"v":0.16674457440543777,"d":"16.67%"},{"v":-0.10272199999999994,"d":"-10.27%"},{"v":7760,"d":"7,760"},{"v":0.9170053475935829,"d":"91.70%"},{"v":16329.11,"d":"16,329"},{"v":0.8773169797145004,"d":"87.73%"},0,0]
["CBP/M",14068,"Replace Samplers for EB/SM","Completed","CTE/P","Sun Aihong","Wu Zefei","2014-08-11","2015-04-30","00:00:00","00:00:00","T_2015","ZNIC.014068","NZNIC014068K",null,14068,{"v":485000,"d":"485,000"},{"v":0,"d":"0 "},{"v":532500,"d":"532,500 "},{"v":8396184.58,"d":"8,396,185 "},{"v":18000,"d":"18,000 "},{"v":14200,"d":"14,200 "},{"v":23064.83,"d":"23,065"},{"v":485000,"d":"485,000"},"0",{"v":182574.70000000016,"d":"182,575"},{"v":485000,"d":"485,000"},{"v":8414184.58,"d":"8,414,185"},{"v":16.34883418556701,"d":"1634.88%"},{"v":8396184.58,"d":"8,396,185"},{"v":18000,"d":"18,000"},0,"0",{"v":-0.4955975551913327,"d":"-49.56%"},{"v":0.12344666666666672,"d":"12.34%"},{"v":14200,"d":"14,200"},{"v":0.8013986013986014,"d":"80.14%"},{"v":23064.83,"d":"23,065"},{"v":0.7015227434487221,"d":"70.15%"},0,0]
["CBP/M",14067,"Replace Some Pumps for EB/SM","On Going","CTE/P","Wang Lifen","Ling Taizhong","2014-08-15","00:00:00","00:00:00","00:00:00","N","ZNIC.014067","NZNIC014067K",null,14067,{"v":1900000,"d":"1,900,000"},{"v":0,"d":"0 "},{"v":2603495,"d":"2,603,495 "},{"v":574600.02,"d":"574,600 "},{"v":0,"d":"0 "},{"v":-72464.76000000001,"d":"(72,465)"},{"v":-120389.16000000003,"d":"-120,389"},{"v":1900000,"d":"1,900,000"},{"v":303189.15999999986,"d":"303,189"},{"v":439999.8200000001,"d":"440,000"},{"v":1900000,"d":"1,900,000"},{"v":1460000.18,"d":"1,460,000"},{"v":-0.23157885263157899,"d":"-23.16%"},{"v":574600.02,"d":"574,600"},0,{"v":582211,"d":"582,211"},{"v":303189.15999999986,"d":"303,189"},{"v":-0.33366759192269924,"d":"-33.37%"},{"v":-0.2991658945432684,"d":"-29.92%"},0,{"v":1.3541777126099708,"d":"135.42%"},0,{"v":1.4667150998255478,"d":"146.67%"},9,8]
["CBP/M",14066,"Revamp Outlet Motor Valves of Cooling Water Pumps","Completed","CTE/A","Gong Feibao","Li Hong","2014-07-23","2015-04-23","00:00:00","00:00:00","T_2015","ZNIC.014066","NZNIC014066K",null,14066,{"v":1380000,"d":"1,380,000"},{"v":0,"d":"0 "},{"v":1446000,"d":"1,446,000 "},{"v":405015.72,"d":"405,016 "},{"v":18205.13,"d":"18,205 "},{"v":-21295,"d":"(21,295)"},{"v":-9865.429999999993,"d":"-9,865"},{"v":1380000,"d":"1,380,000"},"0",{"v":1291047.2,"d":"1,291,047"},{"v":1380000,"d":"1,380,000"},{"v":423220.85,"d":"423,221"},{"v":-0.6933182246376812,"d":"-69.33%"},{"v":405015.72,"d":"405,016"},{"v":18205.13,"d":"18,205"},0,"0",{"v":-0.6314905878827333,"d":"-63.15%"},{"v":-0.14336903967989326,"d":"-14.34%"},0,{"v":1.1253015592821418,"d":"112.53%"},0,{"v":1.0540275465498357,"d":"105.40%"},0,0]
["CBP/B",14058,"Move the BD&IB Plant DCS Control Station from BCC to EBSM","Completed","CTE/A","Gong Feibao","Li Hong","2014-08-19","2015-04-21","00:00:00","00:00:00","T_2015","ZNIC.014058","NZNIC014058K",null,14058,{"v":3400000,"d":"3,400,000"},{"v":0,"d":"0 "},{"v":3410505,"d":"3,410,505 "},{"v":2165099.84,"d":"2,165,100 "},{"v":0,"d":"0 "},{"v":-151971.82,"d":"(151,972)"},{"v":-98115.5,"d":"-98,116"},{"v":3400000,"d":"3,400,000"},"0",{"v":781486.6600000001,"d":"781,487"},{"v":3400000,"d":"3,400,000"},{"v":2168404.84,"d":"2,168,405"},{"v":-0.36223387058823536,"d":"-36.22%"},{"v":2165099.84,"d":"2,165,100"},0,{"v":3305,"d":"3,305"},"0",{"v":-0.27149757211615744,"d":"-27.15%"},{"v":-0.3044872941115733,"d":"-30.45%"},0,{"v":1.5344533849129594,"d":"153.45%"},0,{"v":1.236280553883203,"d":"123.63%"},0,7]
["CEP/E",14051,"Natural Gas Flowmeter Modification","Completed","CTE/P","Gu Jingfeng","Wu Zefei","2014-03-17","2014-09-04","00:00:00","00:00:00","T","ZNIC.014051","NZNIC014051K",null,14051,{"v":157000,"d":"157,000"},{"v":0,"d":"0 "},{"v":158500,"d":"158,500 "},{"v":934930.21,"d":"934,930 "},{"v":8000,"d":"8,000 "},{"v":4950,"d":"4,950 "},{"v":19189.920000000002,"d":"19,190"},{"v":157000,"d":"157,000"},"0",{"v":321.4400000000005,"d":"321"},{"v":157000,"d":"157,000"},{"v":944430.21,"d":"944,430"},{"v":5.015479044585987,"d":"501.55%"},{"v":934930.21,"d":"934,930"},{"v":8000,"d":"8,000"},{"v":1500,"d":"1,500"},"0",{"v":0.11807789473684208,"d":"11.81%"},{"v":-0.64123,"d":"-64.12%"},{"v":4950,"d":"4,950"},{"v":0.9262295081967213,"d":"92.62%"},{"v":19189.920000000002,"d":"19,190"},{"v":0.577081652892562,"d":"57.71%"},0,1]
["CBP/C",14045,"Add Gas Detector around Liquid Hydrocarbon Pumps","Completed","CTE/A","Wang Zhen","Li Hong","2014-07-16","2015-07-09","00:00:00","00:00:00","N","ZNIC.014045","NZNIC014045K",null,14045,{"v":491000,"d":"491,000"},{"v":0,"d":"0 "},{"v":503000,"d":"503,000 "},{"v":2022304.96,"d":"2,022,305 "},{"v":4498,"d":"4,498 "},{"v":-8800,"d":"(8,800)"},{"v":-6600,"d":"-6,600"},{"v":491000,"d":"491,000"},"0",{"v":18860.839999999997,"d":"18,861"},{"v":491000,"d":"491,000"},{"v":2038802.96,"d":"2,038,803"},{"v":3.152348187372709,"d":"315.23%"},{"v":2022304.96,"d":"2,022,305"},{"v":4498,"d":"4,498"},{"v":12000,"d":"12,000"},"0",{"v":0.0356331172172731,"d":"3.56%"},{"v":-0.32467755660022046,"d":"-32.47%"},0,{"v":1.0914285714285714,"d":"109.14%"},0,{"v":1.0923076923076922,"d":"109.23%"},0,0]
["CBP/M",14035,"Revamp H1203 Natural Gas Pipeline","Completed","CTE/P","Sun Aihong","Wu Zefei","2014-06-06","2015-04-30","00:00:00","00:00:00","T_2015","ZNIC.014035","NZNIC014035K",null,14035,{"v":418000,"d":"418,000"},{"v":0,"d":"0 "},{"v":419200,"d":"419,200 "},{"v":235404.64,"d":"235,405 "},{"v":0,"d":"0 "},{"v":-5310,"d":"(5,310)"},{"v":31263.399999999994,"d":"31,263"},{"v":418000,"d":"418,000"},"0",{"v":32076.6,"d":"32,077"},{"v":418000,"d":"418,000"},{"v":235404.64,"d":"235,405"},{"v":-0.43683100478468895,"d":"-43.68%"},{"v":235404.64,"d":"235,405"},0,0,"0",{"v":-0.09670133017770899,"d":"-9.67%"},{"v":-0.28002273062730626,"d":"-28.00%"},0,{"v":1.0412587412587413,"d":"104.13%"},{"v":31263.399999999994,"d":"31,263"},{"v":0.6976460348162477,"d":"69.76%"},0,0]
["CBP/M",14034,"Add an Inhibitor Surge Drum for Each of T2401/2403","Completed","CTE/P","Sun Aihong","Wu Zefei","2014-07-21","2015-09-08","00:00:00","00:00:00","T_2015","ZNIC.014034","NZNIC014034K",null,14034,{"v":477000,"d":"477,000"},{"v":0,"d":"0 "},{"v":542736,"d":"542,736 "},{"v":2301084.59,"d":"2,301,085 "},{"v":30000,"d":"30,000 "},{"v":-24420,"d":"(24,420)"},{"v":-56351.669999999984,"d":"-56,352"},{"v":477000,"d":"477,000"},"0",{"v":70420.5,"d":"70,421"},{"v":477000,"d":"477,000"},{"v":2331084.59,"d":"2,331,085"},{"v":3.886969790356394,"d":"388.70%"},{"v":2301084.59,"d":"2,301,085"},{"v":30000,"d":"30,000"},0,"0",{"v":-0.14459733651459875,"d":"-14.46%"},{"v":-0.38481376645549714,"d":"-38.48%"},0,{"v":1.2065116279069767,"d":"120.65%"},0,{"v":1.401008148016367,"d":"140.10%"},0,2]
["CBP/M",14033,"Add O2 Detector at Discharge of C2401","Completed","CTE/A","Gong Feibao","Li Hong","2014-07-10","2015-11-04","00:00:00","00:00:00","T_2015","ZNIC.014033","NZNIC014033K",null,14033,{"v":246000,"d":"246,000"},{"v":0,"d":"0 "},{"v":352085,"d":"352,085 "},{"v":0,"d":"0 "},{"v":0,"d":"0 "},{"v":-9222.070000000007,"d":"(9,222)"},{"v":-30253,"d":"-30,253"},{"v":246000,"d":"246,000"},{"v":258411.42,"d":"258,411"},{"v":-12411.420000000006,"d":"-12,411"},{"v":246000,"d":"246,000"},{"v":258411.42,"d":"258,411"},{"v":0.050452926829268344,"d":"5.05%"},0,0,0,{"v":258411.42,"d":"258,411"},{"v":0.12231137244111787,"d":"12.23%"},{"v":-0.076076396319281,"d":"-7.61%"},0,{"v":1.1581830188679247,"d":"115.82%"},0,{"v":1.8462377622377621,"d":"184.62%"},7,0]
["CBP/M",14031,"380VAC LV MCC System Modification of EB/SM","Completed","CTE/A","Zhao Wei","Sun Zhongpin","2014-06-05","2015-05-08","2015-10-26","00:00:00","T_2015","ZNIC.014031","NZNIC014031K",null,14031,{"v":12200000,"d":"12,200,000"},{"v":0,"d":"0 "},{"v":12485476,"d":"12,485,476 "},{"v":1276119.98,"d":"1,276,120 "},{"v":0,"d":"0 "},{"v":113179.14000000013,"d":"113,179 "},{"v":-210620.5,"d":"-210,621"},{"$error":"#N/A"},"0",{"$error":"#N/A"},{"v":12200000,"d":"12,200,000"},{"v":1543595.78,"d":"1,543,596"},{"v":-0.873475755737705,"d":"-87.35%"},{"v":1276119.98,"d":"1,276,120"},0,{"v":267475.8,"d":"267,476"},"0",{"$error":"#N/A"},{"v":-0.31299561659959707,"d":"-31.30%"},{"v":113179.14000000013,"d":"113,179"},{"v":0.9159737629459147,"d":"91.60%"},0,{"v":1.5918800056203457,"d":"159.19%"},0,12]
["CBP/C",14023,"Expand the Capacity of 330-V-344","Completed","CTE/P","Qiu Zhufeng","Ling Taizhong","2014-06-04","2015-05-09","00:00:00","00:00:00","T_2015","ZNIC.014023","NZNIC014023K",null,14023,{"v":497000,"d":"497,000"},{"v":100000,"d":"100,000 "},{"v":574600,"d":"574,600 "},{"v":1838951.56,"d":"1,838,952 "},{"v":0,"d":"0 "},{"v":12126.100000000006,"d":"12,126 "},{"v":-6871.169999999984,"d":"-6,871"},{"v":597000,"d":"597,000"},"0",{"v":147937.95000000007,"d":"147,938"},{"v":597000,"d":"597,000"},{"v":1838951.56,"d":"1,838,952"},{"v":2.0803208710217755,"d":"208.03%"},{"v":1838951.56,"d":"1,838,952"},0,0,"0",{"v":-0.3636367819985128,"d":"-36.36%"},{"v":-0.22101803039816156,"d":"-22.10%"},{"v":12126.100000000006,"d":"12,126"},{"v":0.9179698968374768,"d":"91.80%"},0,{"v":1.0515853603603602,"d":"105.16%"},0,4]
["COA/S",14015,"E1210 Condensate Recycle","On Going","CTE/P","Zhu Jianxin","Wu Zefei","2015-01-15","00:00:00","00:00:00","00:00:00","N","ZNIF.106500.15.01","NZNIC014015K",null,14015,{"v":830000,"d":"830,000"},{"v":290000,"d":"290,000 "},{"v":854477,"d":"854,477 "},{"v":307412.69,"d":"307,413 "},{"v":0,"d":"0 "},{"v":154110,"d":"154,110 "},{"v":122850,"d":"122,850"},{"v":1120000,"d":"1,120,000"},{"v":517373.92000000004,"d":"517,374"},{"v":11981.39000000002,"d":"11,981"},{"v":1120000,"d":"1,120,000"},{"v":831058.6100000001,"d":"831,059"},{"v":-0.25798338392857134,"d":"-25.80%"},{"v":307412.69,"d":"307,413"},0,{"v":6272,"d":"6,272"},{"v":517373.92000000004,"d":"517,374"},{"v":-0.04233311395379022,"d":"-4.23%"},{"v":-0.174525,"d":"-17.45%"},{"v":154110,"d":"154,110"},{"v":0.5138485804416404,"d":"51.38%"},{"v":122850,"d":"122,850"},{"v":0.19177631578947368,"d":"19.18%"},0,1]
["CTS/U",14002,"Replace Material of the Pipeline between Compressor and Dryer","Completed","CTE/P","Li Shouqing","Zhang Fanwen","2014-04-23","2015-04-24","00:00:00","00:00:00","T_2015","ZNIC.014002","NZNIC014002K",null,14002,{"v":2360000,"d":"2,360,000"},{"v":0,"d":"0 "},{"v":2377500,"d":"2,377,500 "},{"v":1317699.78,"d":"1,317,700 "},{"v":160101,"d":"160,101 "},{"v":-18560,"d":"(18,560)"},{"v":-77089.53,"d":"-77,090"},{"v":2360000,"d":"2,360,000"},"0",{"v":-448100.20999999996,"d":"-448,100"},{"v":2360000,"d":"2,360,000"},{"v":1495300.78,"d":"1,495,301"},{"v":-0.36639797457627116,"d":"-36.64%"},{"v":1317699.78,"d":"1,317,700"},{"v":160101,"d":"160,101"},{"v":17500,"d":"17,500"},"0",{"v":0.5472564070888835,"d":"54.73%"},{"v":0.04618305274253007,"d":"4.62%"},0,{"v":1.1417876241405653,"d":"114.18%"},0,{"v":1.4421538858617724,"d":"144.22%"},0,0]
["CTS/U",14001,"Add Heat Exchanger of CPS Pipeline to BCC","Completed","CTE/P","Li Shouqing","Zhang Fanwen","2014-06-03","2015-04-30","00:00:00","00:00:00","T_2015","ZNIC.014001","NZNIC014001K",null,14001,{"v":1194000,"d":"1,194,000"},{"v":0,"d":"0 "},{"v":1344261,"d":"1,344,261 "},{"v":3335935.81,"d":"3,335,936 "},{"v":431.09,"d":"431 "},{"v":-21256.47999999998,"d":"(21,256)"},{"v":2578.2999999999884,"d":"2,578"},{"v":1194000,"d":"1,194,000"},"0",{"v":124067.15000000008,"d":"124,067"},{"v":1194000,"d":"1,194,000"},{"v":3338627.9,"d":"3,338,628"},{"v":1.7961707705192629,"d":"179.62%"},{"v":3335935.81,"d":"3,335,936"},{"v":431.09,"d":"431"},{"v":2261,"d":"2,261"},"0",{"v":0.013642027028265512,"d":"1.36%"},{"v":-0.2973925408992106,"d":"-29.74%"},0,{"v":1.125480991735537,"d":"112.55%"},{"v":2578.2999999999884,"d":"2,578"},{"v":0.9846803327391563,"d":"98.47%"},0,2]
["CBP/A",13277,"D230 MCC Modification","Completed","CTE/A","Hu Xiao","Chen Gang","2014-05-05","2015-05-08","00:00:00","00:00:00","T_2015","ZNIC.013277","NZNIC013277K",null,13277,{"v":3950000,"d":"3,950,000"},{"v":0,"d":"0 "},{"v":3964380,"d":"3,964,380 "},{"v":594140.5,"d":"594,141 "},{"v":62.8,"d":"63 "},{"v":-72400.52000000002,"d":"(72,401)"},{"v":91817.32,"d":"91,817"},{"$error":"#N/A"},"0",{"$error":"#N/A"},{"v":3950000,"d":"3,950,000"},{"v":596585.3,"d":"596,585"},{"v":-0.8489657468354431,"d":"-84.90%"},{"v":594140.5,"d":"594,141"},{"v":62.8,"d":"63"},{"v":2382,"d":"2,382"},"0",{"$error":"#N/A"},{"v":0.03675722682019908,"d":"3.68%"},0,{"v":1.4044156961318253,"d":"140.44%"},{"v":91817.32,"d":"91,817"},{"v":0.6536502451904941,"d":"65.37%"},0,4]
["CBP/M",13270,"Gas Detector Modification for EB/SM Tank Farm","Completed","CTE/A","Wang Zhen","Li Hong","2014-03-11","2015-09-03","00:00:00","00:00:00","N","ZNIC.013270","NZNIC013270K",null,13270,{"v":432000,"d":"432,000"},{"v":0,"d":"0 "},{"v":432000,"d":"432,000 "},{"v":436207.83,"d":"436,208 "},{"v":0,"d":"0 "},{"v":-580,"d":"(580)"},{"v":-2475,"d":"-2,475"},{"v":432000,"d":"432,000"},"0",{"v":87683.35999999999,"d":"87,683"},{"v":432000,"d":"432,000"},{"v":436207.83,"d":"436,208"},{"v":0.00974034722222226,"d":"0.97%"},{"v":436207.83,"d":"436,208"},0,0,"0",{"v":-0.433782753655122,"d":"-43.38%"},{"v":-0.23445411583160533,"d":"-23.45%"},0,{"v":1.0082386363636364,"d":"100.82%"},0,{"v":1.0535714285714286,"d":"105.36%"},0,0]
["CHA",13265,"Modify IET Office to Archive Centre Storeroom","Completed","CTE/C","Yu Yi","Jiang Yunning","2014-10-14","2015-02-28","2015-09-04","00:00:00","N","ZNIC.007512","NZNIC013265K",null,13265,{"v":1221000,"d":"1,221,000"},{"v":1600000,"d":"1,600,000 "},{"v":2851000,"d":"2,851,000 "},{"v":342989.4,"d":"342,989 "},{"v":10345.47,"d":"10,345 "},{"v":4252.389999999999,"d":"4,252 "},{"v":-380587.92,"d":"-380,588"},{"v":2821000,"d":"2,821,000"},"0",{"v":208666.36999999976,"d":"208,666"},{"v":2821000,"d":"2,821,000"},{"v":353334.87,"d":"353,335"},{"v":-0.8747483622828783,"d":"-87.47%"},{"v":342989.4,"d":"342,989"},{"v":10345.47,"d":"10,345"},0,"0",{"v":-0.345407319514099,"d":"-34.54%"},{"v":-0.1211815043293436,"d":"-12.12%"},{"v":4252.389999999999,"d":"4,252"},{"v":0.9537783695652174,"d":"95.38%"},0,{"v":4.174211175979983,"d":"417.42%"},0,3]
["COA/E",13263,"Add Solenoid Valve for P5845 and P6660/P6665 Diaphragm Pump Air Supply","Completed","CTA/A","Guo Jinhua","Guo Jinhua","2014-01-22","2015-08-30","00:00:00","00:00:00","N","ZNIC.013263","NZNIC013263K",null,13263,{"v":70000,"d":"70,000"},{"v":0,"d":"0 "},{"v":70000,"d":"70,000 "},{"v":494014.8,"d":"494,015 "},{"v":0,"d":"0 "},{"v":0,"d":"0 "},{"v":1500,"d":"1,500"},{"v":70000,"d":"70,000"},"0",0,{"v":70000,"d":"70,000"},{"v":494014.8,"d":"494,015"},{"v":6.057354285714285,"d":"605.74%"},{"v":494014.8,"d":"494,015"},0,0,"0",{"$error":"#DIV/0!"},{"$error":"#DIV/0!"},0,{"$error":"#DIV/0!"},{"v":1500,"d":"1,500"},{"v":0,"d":"0.00%"},0,0]
["CBP/C",13260,"Upgrade PLC of Turbonmachinery Control System","Completed","CTA/B","Zhao Yongming","Zhao Yongming","2013-12-11","2015-05-31","2015-05-28","00:00:00","T_2015","ZNIC.013260","NZNIC013260K",null,13260,{"v":2000000,"d":"2,000,000"},{"v":0,"d":"0 "},{"v":2000000,"d":"2,000,000 "},{"v":566235.58,"d":"566,236 "},{"v":0,"d":"0 "},{"v":75600,"d":"75,600 "},0,{"v":2000000,"d":"2,000,000"},"0",{"v":490020.6200000001,"d":"490,021"},{"v":2000000,"d":"2,000,000"},{"v":566235.58,"d":"566,236"},{"v":-0.71688221,"d":"-71.69%"},{"v":566235.58,"d":"566,236"},0,0,"0",{"v":-0.24774379111931502,"d":"-24.77%"},{"$error":"#DIV/0!"},{"v":75600,"d":"75,600"},{"v":0.055,"d":"5.50%"},0,{"$error":"#DIV/0!"},0,0]
["CBP/C",13259,"Upgrade Speed Control System of Compressors","Completed","CTA/B","Zhao Yongming","Zhao Yongming","2013-12-11","2015-05-31","2015-05-28","00:00:00","T_2015","ZNIC.013259","NZNIC013259K",null,13259,{"v":2000000,"d":"2,000,000"},{"v":0,"d":"0 "},{"v":2000000,"d":"2,000,000 "},{"v":3953938.62,"d":"3,953,939 "},{"v":80000,"d":"80,000 "},{"v":80000,"d":"80,000 "},0,{"v":2000000,"d":"2,000,000"},"0",{"v":-201573.33999999985,"d":"-201,573"},{"v":2000000,"d":"2,000,000"},{"v":4033938.62,"d":"4,033,939"},{"v":1.0169693100000001,"d":"101.70%"},{"v":3953938.62,"d":"3,953,939"},{"v":80000,"d":"80,000"},0,"0",{"v":0.10337094358974351,"d":"10.34%"},{"$error":"#DIV/0!"},{"v":80000,"d":"80,000"},{"v":0,"d":"0.00%"},0,{"$error":"#DIV/0!"},0,0]
["CBP/M",13257,"Add a Waste Water Pump in EB/SM","Completed","CTE/P","Sun Aihong","Ling Taizhong","2014-03-11","2015-12-11","00:00:00","00:00:00","N","ZNIC.013257","NZNIC013257K",null,13257,{"v":365000,"d":"365,000"},{"v":0,"d":"0 "},{"v":445854,"d":"445,854 "},{"v":15618577.86,"d":"15,618,578 "},{"v":100959.69,"d":"100,960 "},{"v":11640,"d":"11,640 "},{"v":-11766.220000000001,"d":"-11,766"},{"v":365000,"d":"365,000"},{"v":-15399602.03,"d":"-15,399,602"},{"v":26424.480000000025,"d":"26,424"},{"v":365000,"d":"365,000"},{"v":326935.51999999955,"d":"326,936"},{"v":-0.10428624657534369,"d":"-10.43%"},{"v":15618577.86,"d":"15,618,578"},{"v":100959.69,"d":"100,960"},{"v":7000,"d":"7,000"},{"v":-15399602.03,"d":"-15,399,602"},{"v":-0.07490738217401803,"d":"-7.49%"},{"v":-0.1351577502389007,"d":"-13.52%"},{"v":11640,"d":"11,640"},{"v":0.8856019656019656,"d":"88.56%"},0,{"v":1.1506558258642765,"d":"115.07%"},0,1]
["CBP/C",13247,"Modification of Filter System for P230","Completed","CTE/P","Wang Can","Ling Taizhong","2014-07-10","2015-05-09","00:00:00","00:00:00","T_2015","ZNIC.013247","NZNIC013247K",null,13247,{"v":1055000,"d":"1,055,000"},{"v":495000,"d":"495,000 "},{"v":1485801,"d":"1,485,801 "},{"v":0,"d":"0 "},{"v":123215.39,"d":"123,215 "},{"v":-65730.08999999997,"d":"(65,730)"},{"v":-9245.609999999986,"d":"-9,246"},{"v":1055000,"d":"1,055,000"},"0",{"v":-586764.3300000002,"d":"-586,764"},{"v":1550000,"d":"1,550,000"},{"v":123215.39,"d":"123,215"},{"v":-0.9205062,"d":"-92.05%"},0,{"v":123215.39,"d":"123,215"},0,"0",{"v":0.8814700630913824,"d":"88.15%"},{"v":-0.13412816661458285,"d":"-13.41%"},0,{"v":1.3265783106191216,"d":"132.66%"},0,{"v":1.0579571227080393,"d":"105.80%"},1,3]
["CBP/B",13244,"Add Spare Exchangers and Filters in BEU","Completed","CTE/P","Gu Jingfeng","Ling Taizhong","2014-03-11","2015-08-07","00:00:00","00:00:00","T_2015","ZNIC.013244","NZNIC013244K",null,13244,{"v":5250000,"d":"5,250,000"},{"v":0,"d":"0 "},{"v":5251931,"d":"5,251,931 "},{"v":2179329.18,"d":"2,179,329 "},{"v":0,"d":"0 "},{"v":-325563.53,"d":"(325,564)"},{"v":-170071.53000000003,"d":"-170,072"},{"v":5250000,"d":"5,250,000"},"0",{"v":1619190.82,"d":"1,619,191"},{"v":5250000,"d":"5,250,000"},{"v":2180829.18,"d":"2,180,829"},{"v":-0.5846039657142856,"d":"-58.46%"},{"v":2179329.18,"d":"2,179,329"},0,{"v":1500,"d":"1,500"},"0",{"v":-0.4480039321667058,"d":"-44.80%"},{"v":-0.18288445515087043,"d":"-18.29%"},0,{"v":1.8130957292707293,"d":"181.31%"},0,{"v":1.5622199338842977,"d":"156.22%"},0,7]
["CEP/S",13243,"Revamp Rain Drainage System of PS Tank Farm","Completed","CTE/C","Gao Feng","Zhang Zhihe","2014-07-21","2015-08-20","00:00:00","00:00:00","H","ZNIC.013243","NZNIC013243K",null,13243,{"v":561000,"d":"561,000"},{"v":0,"d":"0 "},{"v":598204,"d":"598,204 "},{"v":2308010.69,"d":"2,308,011 "},{"v":5000,"d":"5,000 "},{"v":32768.20000000001,"d":"32,768 "},{"v":-19676.259999999995,"d":"-19,676"},{"v":561000,"d":"561,000"},"0",{"v":49509.95999999999,"d":"49,510"},{"v":561000,"d":"561,000"},{"v":2317010.69,"d":"2,317,011"},{"v":3.1301438324420676,"d":"313.01%"},{"v":2308010.69,"d":"2,308,011"},{"v":5000,"d":"5,000"},{"v":4000,"d":"4,000"},"0",{"v":-0.037725653115574576,"d":"-3.77%"},{"v":-0.1861856843316339,"d":"-18.62%"},{"v":32768.20000000001,"d":"32,768"},{"v":0.8161156004489337,"d":"81.61%"},0,{"v":1.194959227148873,"d":"119.50%"},0,3]
["CAP/E",13240,"Add Jacket Heat Exchanger on V6700","Completed","CTE/P","Xie Qiang","Wu Zefei","2014-01-17","2014-09-04","00:00:00","00:00:00","N","ZNIC.013240","NZNIC013240K",null,13240,{"v":410000,"d":"410,000"},{"v":0,"d":"0 "},{"v":437708,"d":"437,708 "},{"v":853489.94,"d":"853,490 "},{"v":81632.29,"d":"81,632 "},{"v":-5905,"d":"(5,905)"},{"v":-20524.440000000002,"d":"-20,524"},{"$error":"#N/A"},"0",{"$error":"#N/A"},{"v":410000,"d":"410,000"},{"v":936622.23,"d":"936,622"},{"v":1.2844444634146341,"d":"128.44%"},{"v":853489.94,"d":"853,490"},{"v":81632.29,"d":"81,632"},{"v":1500,"d":"1,500"},"0",{"$error":"#N/A"},{"v":-0.27267036731988553,"d":"-27.27%"},0,{"v":1.0547773654916512,"d":"105.48%"},0,{"v":1.241535039717564,"d":"124.15%"},0,1]
["CBL/O",13236,"Rebuild RTTF Operation Room 1&2","Completed","CTE/C","Yu Yi","Guo Bing","2014-09-11","2015-10-31","00:00:00","00:00:00","N","ZNIC.013236","NZNIC013236K",null,13236,{"v":942000,"d":"942,000"},{"v":0,"d":"0 "},{"v":1383028,"d":"1,383,028 "},{"v":4188948.63,"d":"4,188,949 "},{"v":0,"d":"0 "},{"v":-6810,"d":"(6,810)"},{"v":33188.45,"d":"33,188"},{"v":942000,"d":"942,000"},{"v":-3686177.81,"d":"-3,686,178"},{"v":-24642.27000000002,"d":"-24,642"},{"v":942000,"d":"942,000"},{"v":933453.8199999998,"d":"933,454"},{"v":-0.009072377919320772,"d":"-0.91%"},{"v":4188948.63,"d":"4,188,949"},0,{"v":430683,"d":"430,683"},{"v":-3686177.81,"d":"-3,686,178"},{"v":0.5092160197250196,"d":"50.92%"},{"v":-0.38720429950277846,"d":"-38.72%"},0,{"v":1.0483664772727272,"d":"104.84%"},{"v":33188.45,"d":"33,188"},{"v":0.7464595110771581,"d":"74.65%"},0,3]
["CBP/A",13234,"Replacement of 800-UPS-001","Completed","CTE/A","Bian Jiacai","Chen Gang","2014-01-27","2015-04-16","00:00:00","00:00:00","T_2015","ZNIC.013234","NZNIC013234K",null,13234,{"v":774000,"d":"774,000"},{"v":0,"d":"0 "},{"v":774000,"d":"774,000 "},{"v":2898798.17,"d":"2,898,798 "},{"v":20095,"d":"20,095 "},{"v":1251.8899999999994,"d":"1,252 "},{"v":-4677,"d":"-4,677"},{"v":774000,"d":"774,000"},"0",{"v":129054.19,"d":"129,054"},{"v":774000,"d":"774,000"},{"v":2918893.17,"d":"2,918,893"},{"v":2.7711798062015505,"d":"277.12%"},{"v":2898798.17,"d":"2,898,798"},{"v":20095,"d":"20,095"},0,"0",{"v":-0.21640256602516036,"d":"-21.64%"},{"v":0.04820710337527939,"d":"4.82%"},{"v":1251.8899999999994,"d":"1,252"},{"v":0.974849020592667,"d":"97.48%"},0,{"v":1.2074057649667407,"d":"120.74%"},0,3]
["CBP/C",13233,"Replacement of 300-UPS-001","Completed","CTE/A","Bian Jiacai","Chen Gang","2014-01-27","2015-04-23","00:00:00","00:00:00","T_2015","ZNIC.013233","NZNIC013233K",null,13233,{"v":881000,"d":"881,000"},{"v":0,"d":"0 "},{"v":881000,"d":"881,000 "},{"v":2785887.7,"d":"2,785,888 "},{"v":80000,"d":"80,000 "},{"v":11560,"d":"11,560 "},{"v":-2795.880000000001,"d":"-2,796"},{"v":881000,"d":"881,000"},"0",{"v":127408.53,"d":"127,409"},{"v":881000,"d":"881,000"},{"v":2865887.7,"d":"2,865,888"},{"v":2.2529939841089672,"d":"225.30%"},{"v":2785887.7,"d":"2,785,888"},{"v":80000,"d":"80,000"},0,"0",{"v":-0.18571428571428572,"d":"-18.57%"},{"v":0.17742503080925656,"d":"17.74%"},{"v":11560,"d":"11,560"},{"v":0.767754897036665,"d":"76.78%"},0,{"v":1.1239858093126387,"d":"112.40%"},0,2]
["CBP/C",13229,"Replace Economizer with High Efficient Type for SUB","Completed","CTE/P","Qiu Zhufeng","Ling Taizhong","2014-04-14","2015-05-06","00:00:00","00:00:00","T_2015","ZNIC.013229","NZNIC013229K",null,13229,{"v":3054000,"d":"3,054,000"},{"v":1553000,"d":"1,553,000 "},{"v":4073939,"d":"4,073,939 "},{"v":1404921.44,"d":"1,404,921 "},{"v":0,"d":"0 "},{"v":-21153.97,"d":"(21,154)"},{"v":-14625,"d":"-14,625"},{"v":3054000,"d":"3,054,000"},"0",{"v":-196768.88000000012,"d":"-196,769"},{"v":4607000,"d":"4,607,000"},{"v":1444921.44,"d":"1,444,921"},{"v":-0.6863639157803343,"d":"-68.64%"},{"v":1404921.44,"d":"1,404,921"},0,{"v":40000,"d":"40,000"},"0",{"v":0.04776466222247677,"d":"4.78%"},{"v":0.04667500000000002,"d":"4.67%"},0,{"v":1.1236712657117802,"d":"112.37%"},0,{"v":1.1007231404958677,"d":"110.07%"},1,0]
["CCP/A",13224,"Add 2000m3 DEOA Tank in RTTF","Completed","CTE/P","Jiang Hao/Liu Xiaoli","Xu Yefeng/Zong Baorong","2014-02-27","2015-05-05","00:00:00","00:00:00","T_2015","ZNIC.013224","NZNIC013224K",null,13224,{"v":15880000,"d":"15,880,000"},{"v":0,"d":"0 "},{"v":16101960,"d":"16,101,960 "},{"v":163582.22,"d":"163,582 "},{"v":44000,"d":"44,000 "},{"v":332800,"d":"332,800 "},{"v":202300,"d":"202,300"},{"v":15880000,"d":"15,880,000"},"0",{"v":-54575.10000000056,"d":"-54,575"},{"v":15880000,"d":"15,880,000"},{"v":207582.22,"d":"207,582"},{"v":-0.986928071788413,"d":"-98.69%"},{"v":163582.22,"d":"163,582"},{"v":44000,"d":"44,000"},0,"0",{"v":0.5639710571418174,"d":"56.40%"},{"v":-0.27372533829499324,"d":"-27.37%"},{"v":332800,"d":"332,800"},{"v":0,"d":"0.00%"},{"v":202300,"d":"202,300"},{"v":0.18950320512820512,"d":"18.95%"},0,0]
["CTS/U",13209,"Adding a New Ultrasonic Flowmeter on DM Water in CLWI","Hold","CTA/U","Yu Yong","Yu Yong","2013-10-10","00:00:00","00:00:00","00:00:00","N","ZNIC.013209","NZNIC013209K",null,13209,{"v":90000,"d":"90,000"},{"v":0,"d":"0 "},{"v":213215,"d":"213,215 "},{"v":5873055.08,"d":"5,873,055 "},{"v":1583692.53,"d":"1,583,693 "},{"v":0,"d":"0 "},{"v":5000,"d":"5,000"},{"v":90000,"d":"90,000"},{"v":-7371747.61,"d":"-7,371,748"},0,{"v":90000,"d":"90,000"},{"v":85000,"d":"85,000"},{"v":-0.05555555555555555,"d":"-5.56%"},{"v":5873055.08,"d":"5,873,055"},{"v":1583692.53,"d":"1,583,693"},0,{"v":-7371747.61,"d":"-7,371,748"},{"$error":"#DIV/0!"},{"$error":"#DIV/0!"},0,{"$error":"#DIV/0!"},{"v":5000,"d":"5,000"},{"v":0,"d":"0.00%"},0,0]
["COO/C",13198,"NPG_TMA Supply from C1 Plant","Completed","CTE/P","Sun Duoxun","Jiang Haijin","2013-09-11","2015-06-05","00:00:00","00:00:00","T_2015","ZNIC.131198","NZNIC013198K",null,13198,{"v":1676000,"d":"1,676,000"},{"v":0,"d":"0 "},{"v":2185329,"d":"2,185,329 "},{"v":914799.43,"d":"914,799 "},{"v":0,"d":"0 "},{"v":-352510.27,"d":"(352,510)"},{"v":-287309.01,"d":"-287,309"},{"v":1676000,"d":"1,676,000"},"0",{"v":129032.34000000014,"d":"129,032"},{"v":1676000,"d":"1,676,000"},{"v":920799.43,"d":"920,799"},{"v":-0.4505969988066825,"d":"-45.06%"},{"v":914799.43,"d":"914,799"},0,{"v":6000,"d":"6,000"},"0",{"v":-0.31387695278994304,"d":"-31.39%"},{"v":4.2945492578353615E-3,"d":"0.43%"},0,{"$error":"#DIV/0!"},0,{"$error":"#DIV/0!"},0,4]
["COO/O",13197,"NPG_IBA Supply from OXO Plant","Completed","CTE/P","Sun Duoxun","Jiang Haijin","2013-09-11","2015-06-03","00:00:00","00:00:00","T_2015","ZNIC.131197","NZNIC013197K",null,13197,{"v":1720000,"d":"1,720,000"},{"v":0,"d":"0 "},{"v":2319011,"d":"2,319,011 "},{"v":952566.79,"d":"952,567 "},{"v":0,"d":"0 "},{"v":-345333.97,"d":"(345,334)"},{"v":-276334.4,"d":"-276,334"},{"v":1720000,"d":"1,720,000"},"0",{"v":328807.09,"d":"328,807"},{"v":1720000,"d":"1,720,000"},{"v":958566.79,"d":"958,567"},{"v":-0.442693726744186,"d":"-44.27%"},{"v":952566.79,"d":"952,567"},0,{"v":6000,"d":"6,000"},"0",{"v":-0.3909712835423861,"d":"-39.10%"},{"v":-0.17224221986828764,"d":"-17.22%"},0,{"$error":"#DIV/0!"},0,{"$error":"#DIV/0!"},0,3]
["CBP/M",13195,"Replace an Air Dryer","On Going","CTE/P","Ding Juntao","Ling Taizhong","2014-12-24","00:00:00","00:00:00","00:00:00","N","ZNIC.008126","NZNIC013195K",null,13195,{"v":1344000,"d":"1,344,000"},{"v":0,"d":"0 "},{"v":1596491,"d":"1,596,491 "},{"v":1128415.8,"d":"1,128,416 "},{"v":3111.11,"d":"3,111 "},{"v":-49443.01999999999,"d":"(49,443)"},{"v":-27500,"d":"-27,500"},{"v":1344000,"d":"1,344,000"},{"v":-215420.6400000001,"d":"-215,421"},{"v":171914.73000000007,"d":"171,915"},{"v":1344000,"d":"1,344,000"},{"v":1172085.27,"d":"1,172,085"},{"v":-0.12791274553571427,"d":"-12.79%"},{"v":1128415.8,"d":"1,128,416"},{"v":3111.11,"d":"3,111"},{"v":255979,"d":"255,979"},{"v":-215420.6400000001,"d":"-215,421"},{"v":-0.1929626527370442,"d":"-19.30%"},{"v":-0.4685241379310344,"d":"-46.85%"},0,{"v":1.363953036437247,"d":"136.40%"},0,{"v":1.196078431372549,"d":"119.61%"},0,6]
["CBP/C",13190,"Add Explosion-proof Monitoring Camera in BCC&SCTF","Completed","CTE/A","Bian Jiacai","Chen Gang","2014-02-10","2015-06-30","00:00:00","00:00:00","N","ZNIC.013190","NZNIC013190K",null,13190,{"v":5665000,"d":"5,665,000"},{"v":0,"d":"0 "},{"v":5675760,"d":"5,675,760 "},{"v":12384256.04,"d":"12,384,256 "},{"v":6752.13,"d":"6,752 "},{"v":2820,"d":"2,820 "},{"v":-18150,"d":"-18,150"},{"v":5665000,"d":"5,665,000"},"0",{"v":1068608.1800000002,"d":"1,068,608"},{"v":5665000,"d":"5,665,000"},{"v":12391008.17,"d":"12,391,008"},{"v":1.1872918217122683,"d":"118.73%"},{"v":12384256.04,"d":"12,384,256"},{"v":6752.13,"d":"6,752"},0,"0",{"v":-0.23695357186936444,"d":"-23.70%"},{"v":-0.05855974151254571,"d":"-5.86%"},{"v":2820,"d":"2,820"},{"v":0.986235509456986,"d":"98.62%"},0,{"v":1.0666666666666667,"d":"106.67%"},0,0]
["CBP/M",13189,"Air-conditioning System Modification in CCR of 7100","Completed","CTE/C","Gao Feng","Wang Wei","2014-01-28","2015-06-30","00:00:00","00:00:00","N","ZNIC.013189","NZNIC013189K",null,13189,{"v":4234000,"d":"4,234,000"},{"v":0,"d":"0 "},{"v":4398544,"d":"4,398,544 "},{"v":1479893,"d":"1,479,893 "},{"v":0,"d":"0 "},{"v":-54198.119999999995,"d":"(54,198)"},{"v":9568.869999999995,"d":"9,569"},{"$error":"#N/A"},"0",{"$error":"#N/A"},{"v":4234000,"d":"4,234,000"},{"v":1493478,"d":"1,493,478"},{"v":-0.6472654700047237,"d":"-64.73%"},{"v":1479893,"d":"1,479,893"},0,{"v":13585,"d":"13,585"},"0",{"$error":"#N/A"},{"v":-0.19355968256565495,"d":"-19.36%"},0,{"v":1.2324104631217838,"d":"123.24%"},{"v":9568.869999999995,"d":"9,569"},{"v":0.9414210590756046,"d":"94.14%"},0,2]
["CBP/M",13184,"Modify Waste Water System for EB/SM Tank Farm","Completed","CTE/P","Sun Aihong","Ling Taizhong","2014-04-24","2015-11-06","00:00:00","00:00:00","T_2015","ZNIC.013184","NZNIC013184K",null,13184,{"v":4080000,"d":"4,080,000"},{"v":0,"d":"0 "},{"v":4814735,"d":"4,814,735 "},{"v":200821.98,"d":"200,822 "},{"v":0,"d":"0 "},{"v":-20197.27000000002,"d":"(20,197)"},{"v":-169055.05,"d":"-169,055"},{"v":4080000,"d":"4,080,000"},{"v":2328004.77,"d":"2,328,005"},{"v":1233088.25,"d":"1,233,088"},{"v":4080000,"d":"4,080,000"},{"v":2846911.75,"d":"2,846,912"},{"v":-0.30222751225490196,"d":"-30.22%"},{"v":200821.98,"d":"200,822"},0,{"v":318085,"d":"318,085"},{"v":2328004.77,"d":"2,328,005"},{"v":-0.3579345312606359,"d":"-35.79%"},{"v":-0.21212506535294845,"d":"-21.21%"},0,{"v":1.0745630641439778,"d":"107.46%"},0,{"v":1.477286984754376,"d":"147.73%"},0,5]
["CEP/S",13165,"Control System of Pelletizing Upgrading in HIPS","Completed","CTE/A","Gong Feibao","Zeng Qing","2013-11-13","2015-05-28","00:00:00","00:00:00","T_2015","ZNIC.013165","NZNIC013165K",null,13165,{"v":1139000,"d":"1,139,000"},{"v":91000,"d":"91,000 "},{"v":1404921,"d":"1,404,921 "},{"v":1792039.75,"d":"1,792,040 "},{"v":8000,"d":"8,000 "},{"v":58600,"d":"58,600 "},{"v":77500,"d":"77,500"},{"v":1139000,"d":"1,139,000"},"0",{"v":-640000,"d":"-640,000"},{"v":1230000,"d":"1,230,000"},{"v":1800039.75,"d":"1,800,040"},{"v":0.4634469512195122,"d":"46.34%"},{"v":1792039.75,"d":"1,792,040"},{"v":8000,"d":"8,000"},0,"0",{"v":0.6666666666666666,"d":"66.67%"},{"$error":"#DIV/0!"},{"v":58600,"d":"58,600"},{"v":0.38958333333333334,"d":"38.96%"},{"v":77500,"d":"77,500"},{"v":0,"d":"0.00%"},0,0]
["CBP/C",13156,"Add a Control Valve on K650 Outlet Line to Flare","Completed","CTE/P","Qiu Zhufeng","Li Hong","2013-12-17","2015-04-28","00:00:00","00:00:00","T_2015","ZNIC.013156","NZNIC013156K",null,13156,{"v":340000,"d":"340,000"},{"v":0,"d":"0 "},{"v":390000,"d":"390,000 "},{"v":2569715.72,"d":"2,569,716 "},{"v":6557.26,"d":"6,557 "},{"v":22600,"d":"22,600 "},{"v":-9034.339999999997,"d":"-9,034"},{"v":340000,"d":"340,000"},"0",{"v":37188.48000000002,"d":"37,188"},{"v":340000,"d":"340,000"},{"v":2576272.98,"d":"2,576,273"},{"v":6.577273470588235,"d":"657.73%"},{"v":2569715.72,"d":"2,569,716"},{"v":6557.26,"d":"6,557"},0,"0",{"v":-0.2275029403048052,"d":"-22.75%"},{"v":-0.4270674932000759,"d":"-42.71%"},{"v":22600,"d":"22,600"},{"v":0.6712727272727272,"d":"67.13%"},0,{"v":1.2119493255131963,"d":"121.19%"},0,0]
["CAP/A",13133,"Add New Restab Unit System","Completed","CTE/P","Zhu Jianxin","Wu Zefei","2014-01-24","2014-12-16","00:00:00","00:00:00","H","ZNIC.013133","NZNIC013133K",null,13133,{"v":8751000,"d":"8,751,000"},{"v":0,"d":"0 "},{"v":10339693,"d":"10,339,693 "},{"v":987739.89,"d":"987,740 "},{"v":0,"d":"0 "},{"v":-619842.0199999998,"d":"(619,842)"},{"v":-265472.81000000006,"d":"-265,473"},{"v":8751000,"d":"8,751,000"},"0",{"v":1411008.29,"d":"1,411,008"},{"v":8751000,"d":"8,751,000"},{"v":992739.89,"d":"992,740"},{"v":-0.8865569774882871,"d":"-88.66%"},{"v":987739.89,"d":"987,740"},0,{"v":5000,"d":"5,000"},"0",{"v":-0.2634002085671671,"d":"-26.34%"},{"v":-0.333734628793946,"d":"-33.37%"},0,{"v":2.014471391162029,"d":"201.45%"},0,{"v":1.3692250486787205,"d":"136.92%"},9,7]
["CBP/M",13120,"EB/SM Plant Paging System Modification","Completed","CTA/S","Dai Xiaolong","Qiu Wei","2013-07-10","2015-06-30","00:00:00","00:00:00","N","ZNIC.013120","NZNIC013120K",null,13120,{"v":950000,"d":"950,000"},{"v":0,"d":"0 "},{"v":963899,"d":"963,899 "},{"v":488548.7,"d":"488,549 "},{"v":35000,"d":"35,000 "},{"v":-4714,"d":"(4,714)"},{"v":4950.580000000002,"d":"4,951"},{"v":950000,"d":"950,000"},"0",{"v":-159529.90000000002,"d":"-159,530"},{"v":950000,"d":"950,000"},{"v":537447.7,"d":"537,448"},{"v":-0.43426557894736845,"d":"-43.43%"},{"v":488548.7,"d":"488,549"},{"v":35000,"d":"35,000"},{"v":13899,"d":"13,899"},"0",{"v":0.2408857142857143,"d":"24.09%"},{"v":-0.067334074074074,"d":"-6.73%"},0,{"v":1.4714,"d":"147.14%"},{"v":4950.580000000002,"d":"4,951"},{"v":0.8349806666666666,"d":"83.50%"},0,1]
["CEP/S",13115,"PS&EPS Plant Paging System Modification","Completed","CTA/S","Dai Xiaolong","Qiu Wei","2013-07-10","2015-06-30","00:00:00","00:00:00","H","ZNIC.013115","NZNIC013115K",null,13115,{"v":1050000,"d":"1,050,000"},{"v":0,"d":"0 "},{"v":1050000,"d":"1,050,000 "},{"v":10398219.24,"d":"10,398,219 "},{"v":55160,"d":"55,160 "},{"v":-18875,"d":"(18,875)"},{"v":30000,"d":"30,000"},{"v":1050000,"d":"1,050,000"},"0",{"v":-143097.13,"d":"-143,097"},{"v":1050000,"d":"1,050,000"},{"v":10453379.24,"d":"10,453,379"},{"v":8.955599276190476,"d":"895.56%"},{"v":10398219.24,"d":"10,398,219"},{"v":55160,"d":"55,160"},0,"0",{"v":0.20006625,"d":"20.01%"},{"v":-0.14744234782608692,"d":"-14.74%"},0,{"v":2.8875,"d":"288.75%"},{"v":30000,"d":"30,000"},{"v":0,"d":"0.00%"},0,0]
["CEP/S",13114,"Add Back Flow Protection in Utility Supply Pipes","Completed","CTE/P","Gu Jingfeng","Zhang Fanwen","2013-08-29","2015-05-05","00:00:00","00:00:00","T_2015","ZNIC.013114","NZNIC013114K",null,13114,{"v":1996000,"d":"1,996,000"},{"v":0,"d":"0 "},{"v":1999111,"d":"1,999,111 "},{"v":17404454.84,"d":"17,404,455 "},{"v":88866.57,"d":"88,867 "},{"v":-45660.51000000001,"d":"(45,661)"},{"v":-17168.869999999995,"d":"-17,169"},{"v":1996000,"d":"1,996,000"},"0",{"v":618079.7700000001,"d":"618,080"},{"v":1996000,"d":"1,996,000"},{"v":17493321.41,"d":"17,493,321"},{"v":7.7641890831663325,"d":"776.42%"},{"v":17404454.84,"d":"17,404,455"},{"v":88866.57,"d":"88,867"},0,"0",{"v":-0.7247746876472724,"d":"-72.48%"},{"v":-0.20944783236445155,"d":"-20.94%"},0,{"v":1.2758109936575053,"d":"127.58%"},0,{"v":1.0960496223776224,"d":"109.60%"},0,2]
["CTS/U",13112,"CLWI Modification","Completed","CTE/P","Zhou Yanduo","Zhang Fanwen","2013-11-04","2015-01-13","2015-07-10","00:00:00","H","ZNIC.013112","NZNIC013112K",null,13112,{"v":16000000,"d":"16,000,000"},{"v":0,"d":"0 "},{"v":16045806,"d":"16,045,806 "},{"v":9200387.35,"d":"9,200,387 "},{"v":871.8,"d":"872 "},{"v":-7723526.8100000005,"d":"(7,723,527)"},{"v":-493586.35,"d":"-493,586"},{"v":16000000,"d":"16,000,000"},"0",{"v":1068187.919999999,"d":"1,068,188"},{"v":16000000,"d":"16,000,000"},{"v":9240312.65,"d":"9,240,313"},{"v":-0.42248045937499995,"d":"-42.25%"},{"v":9200387.35,"d":"9,200,387"},{"v":871.8,"d":"872"},{"v":39053.5,"d":"39,054"},"0",{"v":-0.05845784352182098,"d":"-5.85%"},{"v":-0.22807791464742422,"d":"-22.81%"},0,{"v":31.894107240000004,"d":"3189.41%"},0,{"v":3.35041119047619,"d":"335.04%"},6,15]
["CCP/A",13106,"Add a EDA Recycle Pump to Produce More PIP/DETA","Completed","CTE/P","Li Shouqing","Wang Wei","2013-08-07","2014-08-31","00:00:00","00:00:00","T","ZNIC.013106","NZNIC013106K",null,13106,{"v":1715000,"d":"1,715,000"},{"v":0,"d":"0 "},{"v":1715000,"d":"1,715,000 "},{"v":35347526.69,"d":"35,347,527 "},{"v":0,"d":"0 "},{"v":17614.53,"d":"17,615 "},{"v":-115361.37,"d":"-115,361"},{"v":1715000,"d":"1,715,000"},"0",{"v":247600.61,"d":"247,601"},{"v":1715000,"d":"1,715,000"},{"v":35347526.69,"d":"35,347,527"},{"v":19.610802734693877,"d":"1961.08%"},{"v":35347526.69,"d":"35,347,527"},0,0,"0",{"v":-0.1883555867164932,"d":"-18.84%"},{"v":-0.2687430769230768,"d":"-26.87%"},{"v":17614.53,"d":"17,615"},{"v":0.931713394068618,"d":"93.17%"},0,{"v":1.8389917818181818,"d":"183.90%"},0,2]
["CBP/C",13105,"Add a Gasoline Reflux Pump for Quench Oil Fractionator","Canceled","CTE/P","Sun Aihong","Ling Taizhong","2014-02-08","00:00:00","00:00:00","00:00:00","T_2015","ZNIC.013105","NZNIC013105K",null,13105,{"v":1947000,"d":"1,947,000"},{"v":0,"d":"0 "},{"v":1947000,"d":"1,947,000 "},{"v":1225101.06,"d":"1,225,101 "},{"v":0,"d":"0 "},{"v":143495,"d":"143,495 "},{"v":239487.52000000002,"d":"239,488"},{"v":1947000,"d":"1,947,000"},{"v":267487.06999999995,"d":"267,487"},{"v":71429.35,"d":"71,429"},{"v":1947000,"d":"1,947,000"},{"v":1492588.13,"d":"1,492,588"},{"v":-0.23339079096045204,"d":"-23.34%"},{"v":1225101.06,"d":"1,225,101"},0,0,{"v":267487.06999999995,"d":"267,487"},{"v":-0.036221877835396266,"d":"-3.62%"},{"v":-0.7775663745892661,"d":"-77.76%"},{"v":143495,"d":"143,495"},{"v":0.4631687242798354,"d":"46.32%"},{"v":239487.52000000002,"d":"239,488"},{"v":0.18074909775079107,"d":"18.07%"},0,0]
["CTA",13096,"C402 HVAC Replacement and Roof Repair","Completed","CTE/C","Yu Yi","Wang Wei","2013-11-25","2015-02-05","00:00:00","00:00:00","N","ZNIC.013096","NZNIC013096K",null,13096,{"v":2660000,"d":"2,660,000"},{"v":0,"d":"0 "},{"v":2668000,"d":"2,668,000 "},{"v":198961.96,"d":"198,962 "},{"v":0,"d":"0 "},{"v":-49810,"d":"(49,810)"},{"v":-426602.39,"d":"-426,602"},{"v":2660000,"d":"2,660,000"},"0",{"v":678663.9,"d":"678,664"},{"v":2660000,"d":"2,660,000"},{"v":198961.96,"d":"198,962"},{"v":-0.9252022706766917,"d":"-92.52%"},{"v":198961.96,"d":"198,962"},0,0,"0",{"v":-0.4295670943902053,"d":"-42.96%"},{"v":-0.153283372560952,"d":"-15.33%"},0,{"v":1.259494660067726,"d":"125.95%"},0,{"v":3.3647582594235033,"d":"336.48%"},0,2]
["CBP/C",13081,"Replace the Electric Heat Tracing on Furnaces","On Going","CTE/A","Wang Zhen","Li Hong","2013-09-04","00:00:00","00:00:00","00:00:00","T_2015","ZNIC.013081","NZNIC013081K",null,13081,{"v":3238000,"d":"3,238,000"},{"v":0,"d":"0 "},{"v":3564454,"d":"3,564,454 "},{"v":3390558.14,"d":"3,390,558 "},{"v":0,"d":"0 "},{"v":-19825,"d":"(19,825)"},{"v":-314050,"d":"-314,050"},{"v":3238000,"d":"3,238,000"},{"v":-856972.03,"d":"-856,972"},{"v":409516.88999999984,"d":"409,517"},{"v":3238000,"d":"3,238,000"},{"v":2828483.1100000003,"d":"2,828,483"},{"v":-0.12647217109326733,"d":"-12.65%"},{"v":3390558.14,"d":"3,390,558"},0,{"v":294897,"d":"294,897"},{"v":-856972.03,"d":"-856,972"},{"v":-0.24299986193839684,"d":"-24.30%"},{"v":-0.1328543151969981,"d":"-13.29%"},0,{"v":1.045627157652474,"d":"104.56%"},0,{"v":1.5947916666666666,"d":"159.48%"},0,0]
["CEP/L",13064,"Fire Alarm System Modification in PS/EPS Logistics","Completed","CTE/A","Hu Xiao","Zhang Pu","2013-09-02","2014-05-27","00:00:00","00:00:00","H","ZNIC.013064","NZNIC013064K",null,13064,{"v":977000,"d":"977,000"},{"v":0,"d":"0 "},{"v":987740,"d":"987,740 "},{"v":7811054.88,"d":"7,811,055 "},{"v":202040.21,"d":"202,040 "},{"v":-27880.01000000001,"d":"(27,880)"},{"v":16225,"d":"16,225"},{"v":977000,"d":"977,000"},"0",{"v":36997.21000000002,"d":"36,997"},{"v":977000,"d":"977,000"},{"v":8013095.09,"d":"8,013,095"},{"v":7.201734994882292,"d":"720.17%"},{"v":7811054.88,"d":"7,811,055"},{"v":202040.21,"d":"202,040"},0,"0",{"v":-0.05324297600259919,"d":"-5.32%"},{"v":-0.04121423428913943,"d":"-4.12%"},0,{"v":1.2325271893244372,"d":"123.25%"},{"v":16225,"d":"16,225"},{"v":0.9118086696562033,"d":"91.18%"},0,2]
["CBP/C",13060,"Add Two Inhibiter Injection Pumps","Completed","CTE/P","Sun Aihong","Ling Taizhong","2014-03-26","2015-05-09","00:00:00","00:00:00","T_2015","ZNIC.013060","NZNIC013060K",null,13060,{"v":650000,"d":"650,000"},{"v":0,"d":"0 "},{"v":685000,"d":"685,000 "},{"v":1995929.24,"d":"1,995,929 "},{"v":0,"d":"0 "},{"v":-1995,"d":"(1,995)"},{"v":36765.83,"d":"36,766"},{"v":650000,"d":"650,000"},"0",{"v":-44714.46999999994,"d":"-44,714"},{"v":650000,"d":"650,000"},{"v":1995929.24,"d":"1,995,929"},{"v":2.0706603692307692,"d":"207.07%"},{"v":1995929.24,"d":"1,995,929"},0,0,"0",{"v":0.16454073818830678,"d":"16.45%"},{"v":-0.2668418823529413,"d":"-26.68%"},0,{"v":1.014865871833085,"d":"101.49%"},{"v":36765.83,"d":"36,766"},{"v":0.7106192050373868,"d":"71.06%"},0,1]
["CAP/L",13058,"IS/IT Project for NASA","Completed","CFA","Liu Min","Tao Yang","2013-05-13","2014-07-01","2014-12-22","00:00:00","N","ZNIC.013058","NZNIC013058K",null,13058,{"v":10180000,"d":"10,180,000"},{"v":2092000,"d":"2,092,000 "},{"v":10453379,"d":"10,453,379 "},{"v":827631.42,"d":"827,631 "},{"v":0,"d":"0 "},{"v":-1839306.56,"d":"(1,839,307)"},0,{"v":10180000,"d":"10,180,000"},"0",0,{"v":12272000,"d":"12,272,000"},{"v":827631.42,"d":"827,631"},{"v":-0.9325593692959583,"d":"-93.26%"},{"v":827631.42,"d":"827,631"},0,0,"0",{"$error":"#DIV/0!"},{"$error":"#DIV/0!"},0,{"$error":"#DIV/0!"},0,{"$error":"#DIV/0!"},0,0]
["CCP/A",13054,"Add 2000m3 EDA Tank in RTTF","Completed","CTE/P","Jiang Hao/Liu Xiaoli","Xu Yefeng/Zong Baorong","2014-02-27","2015-05-05","00:00:00","00:00:00","T_2015","ZNIC.013054","NZNIC013054K",null,13054,{"v":15880000,"d":"15,880,000"},{"v":0,"d":"0 "},{"v":17551322,"d":"17,551,322 "},{"v":991416.14,"d":"991,416 "},{"v":0,"d":"0 "},{"v":-517624.15,"d":"(517,624)"},{"v":-720912.5,"d":"-720,913"},{"v":15880000,"d":"15,880,000"},"0",{"v":24293.10000000056,"d":"24,293"},{"v":15880000,"d":"15,880,000"},{"v":1040416.14,"d":"1,040,416"},{"v":-0.9344826108312342,"d":"-93.45%"},{"v":991416.14,"d":"991,416"},0,{"v":49000,"d":"49,000"},"0",{"v":0.3780810393550388,"d":"37.81%"},{"v":-0.30242961744195335,"d":"-30.24%"},0,{"v":2.667603576030928,"d":"266.76%"},0,{"v":4.096703178694158,"d":"409.67%"},0,1]
["CBP/P",13016,"MarkV Upgrade of Gas Turbines Control System, Power Plant","On Going","CTA/U","Lei Yufa","He Zhengyu","2013-02-01","00:00:00","00:00:00","00:00:00","N","ZNIC.013016","NZNIC013016K",null,13016,{"v":18000000,"d":"18,000,000"},{"v":0,"d":"0 "},{"v":18075872,"d":"18,075,872 "},{"v":23104108.17,"d":"23,104,108 "},{"v":120000,"d":"120,000 "},{"v":460845,"d":"460,845 "},{"v":-267896.5,"d":"-267,897"},{"v":18000000,"d":"18,000,000"},{"v":-11812114.810000002,"d":"-11,812,115"},{"v":6127161.640000001,"d":"6,127,162"},{"v":18000000,"d":"18,000,000"},{"v":11411993.36,"d":"11,411,993"},{"v":-0.3660003688888889,"d":"-36.60%"},{"v":23104108.17,"d":"23,104,108"},{"v":120000,"d":"120,000"},0,{"v":-11812114.810000002,"d":"-11,812,115"},{"v":-0.38982070709584715,"d":"-38.98%"},{"v":0.04953440458467697,"d":"4.95%"},{"v":460845,"d":"460,845"},{"v":0.2910076923076923,"d":"29.10%"},0,{"v":1.8929883333333333,"d":"189.30%"},0,0]
["CBP/C",12137,"Replace Radiant Section Tubes for 7 Liquid Furnaces","Completed","CTE/P","Zhou Yanduo","Tong Shaojian","2013-04-17","2015-12-02","00:00:00","00:00:00","T","ZNIC.012137","NZNIC012137K",null,12137,{"v":58500000,"d":"58,500,000"},{"v":0,"d":"0 "},{"v":63756970,"d":"63,756,970 "},{"v":359673.87,"d":"359,674 "},{"v":794339.62,"d":"794,340 "},{"v":21414.339999999967,"d":"21,414 "},{"v":1324100.3599999999,"d":"1,324,100"},{"v":58500000,"d":"58,500,000"},{"v":53732809.9,"d":"53,732,810"},{"v":2051891.9100000039,"d":"2,051,892"},{"v":58500000,"d":"58,500,000"},{"v":55102593.39,"d":"55,102,593"},{"v":-0.058075326666666656,"d":"-5.81%"},{"v":359673.87,"d":"359,674"},{"v":794339.62,"d":"794,340"},{"v":215770,"d":"215,770"},{"v":53732809.9,"d":"53,732,810"},{"v":0.014511765137251892,"d":"1.45%"},{"v":-0.16678516885769457,"d":"-16.68%"},{"v":21414.339999999967,"d":"21,414"},{"v":0.934286643651707,"d":"93.43%"},{"v":1324100.3599999999,"d":"1,324,100"},{"v":0.4453449115090586,"d":"44.53%"},0,27]
["CBP/B",12119,"Add a Filter to Remove Metal Ions from IBOL","Completed","CTE/P","Sun Aihong","Ling Taizhong","2013-03-26","2014-05-22","2015-07-31","00:00:00","N","ZNIC.012119","NZNIC012119K",null,12119,{"v":1570000,"d":"1,570,000"},{"v":0,"d":"0 "},{"v":1571500,"d":"1,571,500 "},{"v":0,"d":"0 "},{"v":0,"d":"0 "},{"v":-172047.53000000003,"d":"(172,048)"},{"v":-78710.57,"d":"-78,711"},{"$error":"#N/A"},"0",{"$error":"#N/A"},{"v":1570000,"d":"1,570,000"},{"v":1500,"d":"1,500"},{"v":-0.9990445859872611,"d":"-99.90%"},0,0,{"v":1500,"d":"1,500"},"0",{"$error":"#N/A"},{"v":-0.23812805503168324,"d":"-23.81%"},0,{"v":1.7784956108597287,"d":"177.85%"},0,{"v":1.5428315172413793,"d":"154.28%"},0,7]
["CBP/B",12071,"Add Raffinate I Washer Column System in BD Plant","Completed","CTE/P","Cao Lin","Wang Yuncai","2013-09-09","2014-10-27","00:00:00","00:00:00","T_2015","ZNIC.012071","NZNIC012071K",null,12071,{"v":8622000,"d":"8,622,000"},{"v":0,"d":"0 "},{"v":8824040,"d":"8,824,040 "},{"v":0,"d":"0 "},{"v":0,"d":"0 "},{"v":-1043844.1499999999,"d":"(1,043,844)"},{"v":-535306.1200000001,"d":"-535,306"},{"v":8622000,"d":"8,622,000"},"0",{"v":-75000.20999999926,"d":"-75,000"},{"v":8622000,"d":"8,622,000"},0,{"v":-1,"d":"-100.00%"},0,0,0,"0",{"v":0.09062958023208761,"d":"9.06%"},{"v":-0.1071117703370587,"d":"-10.71%"},0,{"v":2.5158933343014813,"d":"251.59%"},0,{"v":1.599497292605762,"d":"159.95%"},2,10]
["CTS/P",12044,"Cooling Water Expansion from PP to Syngas","Completed","CTE/P","Sun Duoxun","Wu Zefei","2014-05-05","2015-04-27","00:00:00","00:00:00","T_2015","ZNIC.012044","NZNIC012044K",null,12044,{"v":3830000,"d":"3,830,000"},{"v":0,"d":"0 "},{"v":3834800,"d":"3,834,800 "},{"v":0,"d":"0 "},{"v":0,"d":"0 "},{"v":-61072.5,"d":"(61,073)"},{"v":-40305.81,"d":"-40,306"},{"v":3830000,"d":"3,830,000"},"0",{"v":1054974.6800000002,"d":"1,054,975"},{"v":3830000,"d":"3,830,000"},0,{"v":-1,"d":"-100.00%"},0,0,0,"0",{"v":-0.4093016482071544,"d":"-40.93%"},{"v":-0.1963874833345581,"d":"-19.64%"},0,{"v":1.287670748940179,"d":"128.77%"},0,{"v":1.2890859601936524,"d":"128.91%"},0,1]
["CBP/M",11229,"Revamp Dosing System of Cooling System of EB/SM","Completed","CTE/P","Zhu Jianxin","Ling Taizhong","2014-03-11","2015-05-09","00:00:00","00:00:00","H","ZNIC.011229","NZNIC011229K",null,11229,{"v":1099000,"d":"1,099,000"},{"v":0,"d":"0 "},{"v":1101000,"d":"1,101,000 "},{"v":0,"d":"0 "},{"v":0,"d":"0 "},{"v":-191656.97999999998,"d":"(191,657)"},{"v":-142193.84999999998,"d":"-142,194"},{"v":1099000,"d":"1,099,000"},"0",{"v":224642.99,"d":"224,643"},{"v":1099000,"d":"1,099,000"},{"v":2000,"d":"2,000"},{"v":-0.9981801637852593,"d":"-99.82%"},0,0,{"v":2000,"d":"2,000"},"0",{"v":-0.012822580406646768,"d":"-1.28%"},{"v":-0.3830494619313376,"d":"-38.30%"},0,{"v":1.8519981329184263,"d":"185.20%"},0,{"v":1.807919602272727,"d":"180.79%"},2,6]

{"sheet":"Sheet6","index":2,"n_rows":163,"n_cols":41,"rows_kept":163,"hidden":true}
["Cost Overview for Projects"]
["B.U.","Job","Project Title","Job\nStatus","Lead\nBy","P.M.","C.M.","Approval\nDate","Hiden Information",{"$nulls":17},"Approved\nBudget\n1","Estimated\nFinal Cost\n5=2+3+4","Devi.(%)\n\n(5-1)/1","Actual\n\n2","Committed\n3",null,"Cost to\ncomplete\n4","Devi.(%)\n_POPR","Devi.(%)\n_SSR","Internal\nEngineering Cost",null,"Internal Const.Supervsn Cost",null,"Wrong Booking Indicator"]
[{"$nulls":8},"M.C.Date","TCCC Date","Business\nClosure Date","Priority","WBS\nAccount","Netowrk","Actual Cost\nMigrated?","Job No.","Original\nBudget","Budget\nChange","Final\ncost","Actual\ncost","Commitment","Rem.M.H\n(Eng)","Rem.M.H\n(Con.Sup)","Budget(used to calculate C2C)","Cost to\ncomplete","Saved\nCost",{"$nulls":4},"PR/PO","SSR",{"$nulls":3},"Rem M.H.\n/RMB","Compl\n(%)","Rem M.H.\n/RMB","Compl\n(%)","Material","SSR"]
["CBP/C",15292,"Modification of the Furnace Burners","On Going","CTE/P","Ding Juntao",0,42369,0,0,0,"N","ZNIC.011312","NZNIC015292K",null,15292,0,0,0,0,2560000,90000,0,0,-2650000,0,0,-90000,{"$error":"#DIV/0!"},0,2560000,0,-2650000,{"$error":"#DIV/0!"},{"$error":"#DIV/0!"},90000,0,0,{"$error":"#DIV/0!"},0,0]
["CEP/L",15278,"Upgrade the HIPS Palletizer","On Going","CTE/P","Zhou Yanduo","Wu Zefei",42368,0,0,0,"N","ZNIC.011307","NZNIC015278K",null,15278,1826000,0,0,0,1300000,117000,97000,1826000,312000,0,1826000,1612000,-0.1171960569550931,0,1300000,0,312000,{"$error":"#DIV/0!"},{"$error":"#DIV/0!"},117000,0,97000,0,0,0]
["CTE",15277,"Add New Road Lamps at 5# Gate and ChengPin Road","On Going","CTE/A","Bian Jiacai","Sun Zhongpin",42360,0,0,0,"N","ZNIF.623100.15.01","NZNIC015277K",null,15277,538000,0,16500,0,0,0,0,538000,538000,0,538000,538000,0,0,0,0,538000,{"$error":"#DIV/0!"},{"$error":"#DIV/0!"},0,{"$error":"#DIV/0!"},0,{"$error":"#DIV/0!"},0,0]
["CBP/U",15267,"Add a Pressure Control valve on CR Line","On Going","CTE/P","Yu Xiya","Jiang Haijing",42356,0,0,0,"N","ZNIF.623350.15.01","NZNIC015267K",null,15267,676000,0,0,0,0,90000,110000,676000,476000,0,676000,476000,-0.2958579881656805,0,0,0,476000,{"$error":"#DIV/0!"},{"$error":"#DIV/0!"},90000,0,110000,0,0,0]
["CBP/U",15263,"Adding Monitoring System for YBS Utility","Completed","CTE/A","Hu Xiao","Sun Zhongpin",42328,42369,0,0,"H","ZNIF.620051.15.01","NZNIC015263K",null,15263,478000,0,770390,14152.7,86534.19,0,0,478000,165376.21,81646.9,478000,396353.1,-0.17080941422594148,14152.7,86534.19,130290,165376.21,-0.40935909129560727,{"$error":"#DIV/0!"},0,{"$error":"#DIV/0!"},0,{"$error":"#DIV/0!"},0,0]
["COA/A",15256,"Add One Common Spare Motor for GAA Molten Salt Pumps","On Going","CTA/L","Zhu Qiang","N/A",42297,0,0,0,"N","ZNIC.010728","NZNIC015256K",null,15256,2750000,0,2750000,0,0,6000,0,2750000,2744000,0,2750000,2744000,-0.002181818181818182,0,0,0,2744000,{"$error":"#DIV/0!"},{"$error":"#DIV/0!"},6000,0,0,{"$error":"#DIV/0!"},0,0]
["COA/A",15247,"B450/B550 MCC Modification","On Going","CTA/L","Yi Yongjun","Sun Zhongpin",42285,0,0,0,"H","ZNIC.010582","NZNIC015247K",null,15247,3500000,0,4610377,25300,1110376.9,109450,177250,3500000,1550400.0000000002,527223.0999999999,3500000,2686076.9000000004,-0.23254945714285705,25300,1110376.9,0,1550400.0000000002,-0.3219486443575964,{"$error":"#DIV/0!"},109450,0.17083333333333334,177250,0.015277777777777777,0,0]
["COA/E",15246,"C7100,C77100,C77400 Raplace the Boken Trays","On Going","CTM/A","Ling Wenqing","Shi Jinsong",42264,0,0,0,"N","ZNIC.010345","NZNIC015246K",null,15246,2687000,0,4141957,0,1454957.27,0,0,2687000,934342.74,297699.99,2687000,2389300.01,-0.11079270189802762,0,1454957.27,0,934342.74,-0.14884999499999998,{"$error":"#DIV/0!"},0,{"$error":"#DIV/0!"},0,{"$error":"#DIV/0!"},0,0]
["COO/A",15245,"Install Filters on the Bottom Discharge Lines of C2300 and C2500","On Going","CTE/P","Zhang Bianlin","Jiang Haijin",42339,0,0,0,"N","ZNIC.011107","NZNIC015245K",null,15245,1252000,0,1998000,4400,669959.87,165600,130000,1252000,199463.08000000002,82577.04999999999,1252000,873822.95,-0.30205834664536746,4400,669959.87,0,199463.08000000002,-0.2866521646083706,{"$error":"#DIV/0!"},165600,0.02588235294117647,130000,0,0,0]
["CEP/S",15242,"Relocation the Cable of PS Plant","On Going","CTE/A","Bian Jiacai","Sun Zhongpin",42334,0,0,0,"N","ZNIC.011082","NZNIC015242K",null,15242,3196000,0,3196000,9330,800000,326670,198000,3196000,1862000,0,3196000,2671330,-0.1641645807259074,9330,800000,0,1862000,{"$error":"#DIV/0!"},{"$error":"#DIV/0!"},326670,0.027767857142857143,198000,0,0,0]
["CBP/B",15198,"Install two CCTVs in BD Plant","On Going","CTE/A","Hu Xiao","Chen Gang",42305,0,0,0,"N","ZNIF.104500.15.03","NZNIC015198K",null,15198,217000,0,337980,762.24,105748.42,0,0,217000,108119.36000000002,2369.979999999996,217000,214630.02000000002,-0.010921566820276412,762.24,105748.42,0,108119.36000000002,-0.019362581699346373,{"$error":"#DIV/0!"},0,{"$error":"#DIV/0!"},0,{"$error":"#DIV/0!"},0,0]
["COO/C",15197,"Revamping of C1 Flare KO Drums","On Going","CTE/P","Li Shouqing","Jiang Haijin",42367,0,0,0,"N","ZNIC.011291","NZNIC015197K",null,15197,1340000,0,0,0,115000,231550,268125,1340000,725325,0,1340000,840325,-0.3728917910447761,0,115000,0,725325,{"$error":"#DIV/0!"},{"$error":"#DIV/0!"},231550,0,268125,0,0,0]
["CBL/P",15180,"Air Conditioning Replacement for Jetty1/2/3 Operation Room","Completed","CTE/C","Wang Wei","Wang Wei",42271,42334,0,0,"N","ZNIF.604220.15.01","NZNIC015180K",null,15180,94000,0,94000,10990.54,0,-4675,0,94000,82724.99999999999,284.46000000000004,94000,93715.53999999998,-3.0261702127661804E-3,10990.54,0,0,82724.99999999999,{"$error":"#DIV/0!"},-0.043100000000000006,0,{"$error":"#DIV/0!"},0,{"$error":"#DIV/0!"},0,0]
["CTM",15176,"Add Card Reader at D700 Central Workshop","On Going","CTE/A","Xu Zheng",0,42247,0,0,0,"N","ZNIF.642320.15.03","NZNIC015176K",null,15176,0,0,42094,26642.42,15811.97,14090,39000,0,-95177.56,-366.82999999999447,0,-52723.17,{"$error":"#DIV/0!"},26642.42,15811.97,0,-95177.56,0.01111934249684587,{"$error":"#DIV/0!"},14090,0.4967857142857143,39000,0,0,0]
["CEP/S",15168,"PS Chilling Unit Replacement","On Going","CTE/P","Gu Jingfeng","Wu Zefei",42328,0,0,0,"N","ZNIC.011038","NZNIC015168K",null,15168,2910000,0,4470000,18150,1560000,270050,245575,2910000,816225,0,2910000,2394375,-0.17719072164948454,18150,1560000,0,816225,{"$error":"#DIV/0!"},{"$error":"#DIV/0!"},270050,0.06297709923664122,245575,0,0,0]
["CBP/C",15167,"Add Adjusters for One of the Furnaces Bottom Air Registers","On Going","CTE/P","Zhou Yanduo","Ling Taizhong",42368,0,0,0,"N","ZNIC.011308","NZNIC015167K",null,15167,1490000,0,0,0,850000,162525,145200,1490000,332275,0,1490000,1182275,-0.2065268456375839,0,850000,0,332275,{"$error":"#DIV/0!"},{"$error":"#DIV/0!"},162525,0,145200,0,0,0]
["CBP/M",15149,"Steel Structure Extension of Gas Cylinder Room of CTS/L","On Going","CTE/C","Wang Shicheng","Zhang Zhihe",42277,0,0,0,"N","ZNIF.660300.15.01","NZNIC015149K",null,15149,264000,0,377771,91219.39,0,-69360,-11000,264000,52847.779999999984,1104.8299999999997,264000,262895.17,-0.004184962121212183,91219.39,0,118828,52847.779999999984,-0.04967252554687989,-0.29588,0,{"$error":"#DIV/0!"},0,{"$error":"#DIV/0!"},0,1]
["CBP/C",15143,"Add Combustible Gas Detector in BCC Cylinder Room","On Going","CTE/A","Gong Feibao","Li Hong",42307,0,0,0,"N","ZNIF.104100.15.06","NZNIC015143K",null,15143,70000,0,74202,6600,4201.71,7400,19000,70000,32214.29,584,70000,43016,-0.38548571428571426,6600,4201.71,0,32214.29,-0.10618181818181818,{"$error":"#DIV/0!"},7400,0.4714285714285714,19000,0,0,0]
["CBP/B",15124,"Add Pump and Flow Control Valve on the Line for Sending Dimer to C-250","On Going","CTE/P","Chen Chen","Ling Taizhong",42212,0,0,0,"T","ZNIF.104500.15.01","NZNIC015124K",null,15124,730000,0,785138,144705.94,113946.5,96600,142450,730000,189717.46000000008,42580.09999999998,730000,448369.9000000001,-0.38579465753424647,144705.94,113946.5,0,189717.46000000008,-0.24213438972979548,{"$error":"#DIV/0!"},96600,0.4215568862275449,142450,0.075,0,0]
["CTM",15122,"D700 Garbage Disposal Field Modification","On Going","CTE/C","Xia Qun","Xu Zhaofeng",42201,0,0,0,"N","ZNIF.642320.15.02","NZNIC015122K",null,15122,369430,0,607585,52428.77,0,37355,42100,369430,-3673.0000000000186,164.23000000000002,369430,289810.77,-0.2155191240559781,52428.77,0,241055,-3673.0000000000186,{"$error":"#DIV/0!"},-0.08019042968750001,37355,0.5210897435897436,42100,0.19038461538461537,0,1]
["CBP/C",15117,"Add the Differential Pressure Signal of the Instrument Air Filter in DCS System","On Going","CTE/P","Zhang Fanwen","Li Hong",42257,0,0,0,"N","ZNIF.104100.15.04","NZNIC015117K",null,15117,98000,0,109219,24266,11218.88,-20140,-1100,98000,47734,14781.12,98000,83218.88,-0.15082775510204077,24266,11218.88,0,47734,-0.5685046153846154,{"$error":"#DIV/0!"},0,{"$error":"#DIV/0!"},0,{"$error":"#DIV/0!"},0,0]
["CEP/E",15116,"Set a Waste Storage Area beside Tank Farm","On Going","CTE/C","Yan Jun","Xu Zhaofeng",42236,0,0,0,"H","ZNIF.105600.15.01","NZNIC015116K",null,15116,382000,0,475340,69271.93,9073.97,63030,98900,382000,57288.060000000034,-3483.959999999999,382000,223553.96000000002,-0.4147802094240837,69271.93,9073.97,87920,57288.060000000034,0.06873192289231354,{"$error":"#DIV/0!"},63030,0.30736263736263736,98900,0.011,0,0]
["CBL/P",15112,"Add Emergency Storage Area for Jettys in CLTF Reserved Land","On Going","CTE/P","Yu Yi","Guo Yibing",42305,0,0,0,"N","ZNIF.604110.15.01","NZNIC015112K",null,15112,970000,0,1584746,14195,130872,10805,47000,970000,283254,9128,970000,903067,-0.06900309278350515,14195,130872,474746,283254,-0.0652,{"$error":"#DIV/0!"},10805,0.5678,47000,0,0,0]
["CTM",15102,"Cleaning Room Renovation Project of Central Workshop","On Going","CTM/W","Zhai Chunrong","Lei Fucun",42201,0,0,0,"N","ZNIF.642320.15.01","NZNIC015102K",null,15102,958000,0,1566340,236387.42,41932.48,-11457.149999999994,44000,958000,6210.829999999965,55008.77000000001,958000,858991.23,-0.10334944676409187,236387.42,41932.48,574460.5,6210.829999999965,-0.3736162585034014,-0.14529999999999993,0,1.0670008771929824,44000,0,0,1]
["CBP/M",15097,"Improve Operation Method for Compound TBC","On Going","CTE/P","Wang Can","Ling Taizhong",42361,0,0,0,"N","ZNIF.104400.15.01","NZNIC015097K",null,15097,598000,0,0,0,70000,183000,142000,598000,203000,0,598000,273000,-0.5434782608695652,0,70000,0,203000,{"$error":"#DIV/0!"},{"$error":"#DIV/0!"},183000,0,142000,0,0,0]
["CBP/C",15091,"Add a New Solid Waste Storage Area","Canceled","CTE/C","Wang Shicheng","Zhang Zhihe",42345,0,0,0,"N","ZNIF.104100.15.08","NZNIC015091K",null,15091,257000,0,0,0,0,47000,56000,257000,154000,0,257000,154000,-0.40077821011673154,0,0,0,154000,{"$error":"#DIV/0!"},{"$error":"#DIV/0!"},47000,0,56000,0,0,0]
["CBP/C",15089,"Modify Lubrication oil Room and Spare Parts Stroge Room at West of Control Building","On Going","CTE/C","Wang Shicheng","Zhang Zhihe",42345,0,0,0,"N","ZNIF.104100.15.07","NZNIC015089K",null,15089,752000,0,0,0,3000,122000,94000,752000,533000,0,752000,536000,-0.2872340425531915,0,3000,0,533000,{"$error":"#DIV/0!"},{"$error":"#DIV/0!"},122000,0,94000,0,0,0]
["CTM",15079,"Fire Alarm System Modification for #5 Warehouse in East Laydown","On Going","CTE/A","Bian Jiacai","Sun Zhongpin",42209,0,0,0,"N","ZNIF.641330.15.01","NZNIC015079K",null,15079,220000,0,262386,56014.01,9442.28,-37045,-2475,220000,76839.18,8654.529999999999,220000,211345.47,-0.03933877272727272,56014.01,9442.28,69050,76839.18,-0.2219110256410256,{"$error":"#DIV/0!"},0,{"$error":"#DIV/0!"},0,{"$error":"#DIV/0!"},0,0]
["CEP/P",15071,"Build a Spare Part&Tool Warehouse","On Going","CTE/C","Gao Feng","Xia Weiguang",42298,0,0,0,"H","ZNIC.010748","NZNIC015071K",null,15071,1222000,0,1499847,68750,7683.76,119350,129250,1222000,333303.24,200,1222000,973200,-0.20360065466448446,68750,7683.76,563463,333303.24,-0.2,{"$error":"#DIV/0!"},119350,0.3654970760233918,129250,0,0,0]
["CBL/P",15066,"Add On-line Water Analyzer on the NAP Unloading Piping of Jetty 4#","On Going","CTE/A","Xu Ge","Wang Xinwu",42247,0,0,0,"N","ZNIF.651130.15.01","NZNIC015066K",null,15066,547000,0,816231,35790.48,271713.5,39800,34500,547000,174235.82,-15039.799999999988,547000,487739.8,-0.1083367458866545,35790.48,271713.5,6000,174235.82,0.049658428672840996,{"$error":"#DIV/0!"},39800,0.3254237288135593,34500,0.3235294117647059,0,0]
["CTS",15061,"BCC Lab Modification","On Going","CTE/C","Yu Yi","Jiang Yunning",42166,0,0,0,"N","ZNIC.009551","NZNIC015061K",null,15061,3490000,290000,6411751,66046.96,2751631.89,75640,69300,3490000,637629.79,-292248.64000000013,3780000,3637308.64,-0.037749037037037005,66046.96,2751631.89,182000,637629.79,0.100306920010119,{"$error":"#DIV/0!"},75640,0.322525750111957,69300,0.26744186046511625,0,1]
["C",15051,"Set Up Intranet Portal System","On Going","CGA/I","Tao Yang","Tao Yang",42081,0,0,0,"N","ZNIT.001180","NZNIC015051K",null,15051,2735000,0,4659799,239017.94,1919138.84,0,0,2735000,576843.22,0,2735000,2735000,0,239017.94,1919138.84,0,576843.22,0,{"$error":"#DIV/0!"},0,{"$error":"#DIV/0!"},0,{"$error":"#DIV/0!"},0,0]
["CBP/P",15047,"Change New CEMS","On Going","CTA/S","Tang Yiqun","Tang Yiqun",42073,0,0,0,"N","ZNIC.008734","NZNIC015047K",null,15047,1203000,0,1344000,852242.9,17295.75,5500,0,1203000,21729.139999999985,206232.21,1203000,991267.79,-0.17600349958437236,852242.9,17295.75,100000,21729.139999999985,-0.16645215071972905,-0.32174066666666673,5500,0,0,{"$error":"#DIV/0!"},0,0]
["CBP/C",15042,"Add On-line Analyzer on the Outlet of the Z-908","On Going","CTE/A","Gong Feibao","Li Hong",42298,0,0,0,"H","ZNIC.010800","NZNIC015042K",null,15042,1145000,0,1732778,72640,414580.35,148435,105300,1145000,283403.65,120641,1145000,770624,-0.3269659388646288,72640,414580.35,0,283403.65,-0.19917615981509,{"$error":"#DIV/0!"},148435,0.271931330472103,105300,0.1404081632653061,0,0]
["CBP/C",15036,"Expand the Capacity of the Suspect Condensate Vent Condenser 390-E-920","Completed","CTE/P","Ding Juntao","Tong Shaojian",42135,42293,0,0,"H","ZNIF.104100.15.02","NZNIC015036K",null,15036,398000,0,398000,184174.06,0,57450,28000,398000,94429.67000000001,33946.27,398000,278603.73,-0.29999062814070354,184174.06,0,0,94429.67000000001,-0.2232267333333333,-0.0711169230769231,57450,0.5775735294117647,28000,0,0,0]
["CBP/C",15034,"Add Pressure&Temperature Signal DCS System for Three Drums at AEU Section","On Going","CTE/A","Gong Feibao","Li Hong",42265,0,0,0,"N","ZNIF.104100.15.05","NZNIC015034K",null,15034,170000,0,193852,5856.45,23578.39,0,-550,170000,134053.75999999998,6511.399999999994,170000,163488.59999999998,-0.03830235294117661,5856.45,23578.39,0,134053.75999999998,-0.2144776533350196,{"$error":"#DIV/0!"},0,{"$error":"#DIV/0!"},0,{"$error":"#DIV/0!"},0,0]
["CEP/P",15028,"Upgrade 4 sets PO Cupboard Freezer","On Going","CTE/P","Ding Juntao","Wang Yuncai",42296,0,0,0,"T","ZNIC.010799","NZNIC015028K",null,15028,1319000,0,2129000,25090,673943.73,122310,50050,1319000,426120.43000000005,21485.839999999967,1319000,1125154.1600000001,-0.14696424564063673,25090,673943.73,0,426120.43000000005,-0.026525728395061687,{"$error":"#DIV/0!"},122310,0.14468531468531468,50050,0.08080808080808081,0,0]
["CEP/S",15026,"PS Positive Draft of Control Building Modification","On Going","CTE/C","Gao Feng","Wang Wei",42194,0,0,0,"H","ZNIC.009794","NZNIC015026K",null,15026,1256000,0,2062440,121067.89,789459.83,73910.85,53350,1256000,150289.17000000022,-12216.58000000005,1256000,1140955.7300000002,-0.09159575636942659,121067.89,789459.83,80138.84,150289.17000000022,0.01332797801478095,-0.05660416666666663,73910.85,0.5268191421254801,53350,0.19166666666666668,0,1]
["COA/S",15024,"SAP Steam System Energy Saving Modification","On Going","CTE/P","Xu Jin","Wang Yuncai",42265,0,0,0,"N","ZNIC.010440","NZNIC015024K",null,15024,1419000,0,1559598,54300.76,127648.57,132100,196900,1419000,878033.7499999999,27516.920000000042,1419000,1062483.0799999998,-0.25124518675123336,54300.76,127648.57,2500,878033.7499999999,-0.1546370455623419,{"$error":"#DIV/0!"},132100,0.1297760210803689,196900,0.05789473684210526,0,0]
["CEP/E",15022,"Revamp HVAC System in EOEG Control Building","Completed","CTE/C","Gao Feng","Wang Wei",42131,42342,0,0,"H","ZNIC.009264","NZNIC015022K",null,15022,1391000,0,1473957,1035368.41,13711.11,56686.98999999999,4950,1391000,434789.08,-164661.59000000003,1391000,1494024.6,0.07406513299784334,1035368.41,13711.11,10156,434789.08,0.19386503067484662,0.10521511829927048,56686.98999999999,0.6095937327823692,4950,0.9196428571428571,0,4]
["CTS",15016,"Environmental Monitoring Car","On Going","CTS/E","Fan Chenxi","Fan Chenxi",42017,0,0,0,"N","ZNIC.008204","NZNIC015016K",null,15016,4000000,0,4542735,0,4542735.05,0,0,4000000,272264.95999999996,-815000.0099999998,4000000,4815000.01,0.20375000249999994,0,4542735.05,0,272264.95999999996,0.1811111133333333,{"$error":"#DIV/0!"},0,{"$error":"#DIV/0!"},0,{"$error":"#DIV/0!"},0,0]
["CEP/L",15014,"PS A915 Emergency Lighting and Fire Alarm System Modification","Completed","CTE/A","Xu Zheng","Zhang Pu",42067,42269,0,0,"N","ZNIF.175410.15.01","NZNIC015014K",null,15014,434000,0,474825,464825.16,0,12220,30050,434000,"0",-31728.639999999956,434000,474825.16,0.09406718894009211,464825.16,0,10000,"0",0.2851557400028738,-0.022250304735114954,12220,0.8433333333333334,30050,0.6196202531645569,0,0]
["CTM",15011,"Modification for Main Door of Spare Parts Warehouse","On Going","CTE/C","Yu Yi","Xu Zhaofeng",42216,0,0,0,"N","ZNIF.641330.15.02","NZNIC015011K",null,15011,384000,0,626000,6520,242000,46480,43000,384000,58000,-12000,384000,306520,-0.20177083333333334,6520,242000,0,58000,0.05217391304347826,{"$error":"#DIV/0!"},46480,0.1230188679245283,43000,0,0,0]
["COA/E",15010,"Replace the Material of P7120A/B by PFA","On Going","CTE/P","Xu Jin","Wu Zefei",42226,0,0,0,"T","ZNIF.106200.15.01","NZNIC015010K",null,15010,495000,0,722707,47555,227706.96,51995,54450,495000,99710.18000000002,13582.859999999986,495000,374972.14,-0.24248052525252523,47555,227706.96,0,99710.18000000002,-0.04851021428571423,{"$error":"#DIV/0!"},51995,0.4747979797979798,54450,0.01,0,0]
["CEP/E",15009,"Modify Suction Side of P4330","On Going","CTE/P","Gu Jingfeng","Wu Zefei",42139,0,0,0,"T","ZNIF.105700.15.01","NZNIC015009K",null,15009,590000,0,672139,248275.91,19205.38,47245,75600,590000,142540.67999999996,57133.03,590000,410021.97,-0.30504750847457635,248275.91,19205.38,0,142540.67999999996,-0.2789726654978724,{"$error":"#DIV/0!"},47245,0.70471875,75600,0.055,0,0]
["COA/A",15004,"Revamp HVAC System in B550 Control Building","Completed","CTE/C","Gao Feng","Wang Wei",42131,42253,0,0,"H","ZNIC.009265","NZNIC015004K",null,15004,1564000,0,1577128,1011375.73,0,70660,33550,1564000,"0",223669.20000000004,1564000,1019375.73,-0.34822523657289006,1011375.73,0,8000,"0",-0.2191479443225687,-0.04829038599582354,70660,0.565970515970516,33550,0.5234375,0,1]
["CBP/C",14313,"Replace Existing Electrical Heater H-520","On Going","CTE/A","Hu Xiao","Chen Gang",42139,0,0,0,"N","ZNIC.009347","NZNIC014313K",null,14313,1885000,0,2957457,58390,1072456.67,59860,63800,1885000,579446.1400000001,51047.189999999944,1885000,1710292.81,-0.09268285941644559,58390,1072456.67,0,579446.1400000001,-0.04770765420560742,{"$error":"#DIV/0!"},59860,0.49378435517970404,63800,0,0,0]
["CBP/M",14312,"Replace Exchanger E2320 of EB/SM","Completed","CTM/M","Chu Chao","Chu Chao",41997,42154,0,0,"T_2015","ZNIC.008125","NZNIC014312K",null,14312,2160000,0,2160000,1716239.32,0,13750,0,2160000,"0",0,2160000,1716239.32,-0.20544475925925923,1716239.32,0,0,"0",{"$error":"#DIV/0!"},{"$error":"#DIV/0!"},13750,0,0,{"$error":"#DIV/0!"},0,0]
["CEP/E",14311,"Change New C2450/CX2450/E1250A/E1250B/E1252","Completed","CTM/E","Wang Zhigao","Wang Zhigao",41997,42128,0,0,"T_2015","ZNIC.008124","NZNIC014311K",null,14311,1675000,487000,2061290,2061289.79,0,8000,8000,1675000,"0",0,2162000,2061289.79,-0.04658196577243291,2061289.79,0,0,"0",{"$error":"#DIV/0!"},{"$error":"#DIV/0!"},8000,0,8000,0,0,0]
["COA/S",14309,"Add Extrusion Step for New Product AGM7","On Going","CTE/P","Zhu Jianxin","Cao Yongbin",42096,0,0,0,"H","ZNIC.008120","NZNIC014309K",null,14309,27782000,0,51729014,4764929.34,21832964.62,144197.92000000004,1280575,27782000,-3814277.8599999966,1880610.9799999958,27782000,24476616.100000005,-0.11897573608811442,4764929.34,21832964.62,1693000,-3814277.8599999966,-0.07533359291496114,-0.17610656495607957,144197.92000000004,0.8690002997955939,1280575,0.08936888888888889,0,3]
["CBP/M",14308,"Modification of EB/SM Cooling Water Pumps","On Going","CTE/P","Wang Lifen","Ling Taizhong",42107,0,0,0,"N","ZNIC.009023","NZNIC014308K",null,14308,1357000,0,1673033,1044929.1,2600,-1025,57725,1357000,-65676.03999999992,79388.93999999994,1357000,1219886.06,-0.10104196020633746,1044929.1,2600,238033,-65676.03999999992,-0.07535267401631598,{"$error":"#DIV/0!"},0,1.0076492537313433,57725,0.5724074074074074,0,2]
["CBP/M",14307,"Replacement of F2404","Completed","CTM/M","Chu Chao","Chu Chao",41992,42154,0,0,"T_2015","ZNIF.104400.14.04","NZNIC014307K",null,14307,192000,0,192000,0,0,8000,0,192000,"0",0,192000,0,-1,0,0,0,"0",{"$error":"#DIV/0!"},{"$error":"#DIV/0!"},8000,0,0,{"$error":"#DIV/0!"},0,0]
["CBP/M",14306,"Replacement of F2406","Completed","CTM/M","Chu Chao","Chu Chao",41992,42125,0,0,"T_2015","ZNIF.104400.14.03","NZNIC014306K",null,14306,210000,0,210000,0,0,8000,0,210000,"0",0,210000,0,-1,0,0,0,"0",{"$error":"#DIV/0!"},{"$error":"#DIV/0!"},8000,0,0,{"$error":"#DIV/0!"},0,0]
["CBP/M",14305,"Replacement of E1203","Completed","CTM/M","Chu Chao","Chu Chao",41991,42155,0,0,"T_2015","ZNIF.104400.14.02","NZNIC014305K",null,14305,224000,0,224000,0,0,8000,0,224000,"0",0,224000,0,-1,0,0,0,"0",{"$error":"#DIV/0!"},{"$error":"#DIV/0!"},8000,0,0,{"$error":"#DIV/0!"},0,0]
["COA/A",14296,"Install Filters at Outlet of P9326/P9526","Completed","CTE/P","Xu Jin","Wu Zefei",42096,42342,0,0,"N","ZNIF.106600.15.01","NZNIC014296K",null,14296,830000,0,955432,499820.89,0,25465,-20175,830000,-47744.53000000003,255348.64,830000,549186.36,-0.338329686746988,499820.89,0,97110,-47744.53000000003,-0.45677774476508665,-0.15596779888425957,25465,0.8324671052631579,0,1.3011194029850746,0,0]
["CBP/M",14288,"T2401 Replace Structure Packing of EB/SM","Completed","CTM/M","Chu Chao","Chu Chao",41974,42155,0,0,"T_2015","ZNIC.007947","NZNIC014288K",null,14288,2645000,0,2645000,2330341.89,0,13750,27500,2645000,"0",177495.99000000022,2645000,2330341.89,-0.11896336862003776,2330341.89,0,0,"0",-0.06112129286679466,{"$error":"#DIV/0!"},13750,0,27500,0,0,0]
["CEP/P",14287,"Add a Differential Pressure Transmitter in Control Room","Completed","CTE/A","Xu Ge","Li Xueyong",42011,42174,0,0,"N","ZNIF.678152.15.01","NZNIC014287K",null,14287,104000,0,105300,58883.38,0,2471.779999999999,4300,104000,"0",2327.8700000000003,104000,58883.38,-0.4338136538461539,58883.38,0,0,"0",-0.14294875,-0.24258090946333474,2471.779999999999,0.922756875,4300,0.8130434782608695,0,1]
["CBP/M",14286,"Change Gas Chromatograph A24201 to New Type","On Going","CTA/S","Li Huaxin","Li Huaxin",41970,0,0,0,"N","ZNIF.104400.14.01","NZNIC014286K",null,14286,480000,0,480000,316000,0,2000,4000,480000,57720,100280,480000,373720,-0.22141666666666668,316000,0,0,57720,-0.21336170212765956,{"$error":"#DIV/0!"},2000,0,4000,0,0,0]
["CTS/U",14275,"Add Flowmeter on Main Pipeline for HPNG","Completed","CTE/A","Wang Zhen","Wang Xinwu",41997,42352,0,0,"T_2015","ZNIC.008123","NZNIC014275K",null,14275,1151000,0,1141315,1115658.21,0,-41380,-137100.49000000002,1151000,-77316.99999999985,32658.78999999989,1151000,1118341.2100000002,-0.02837427454387472,1115658.21,0,80000,-77316.99999999985,-0.043350123686585126,-0.00604116660063866,0,1.4649438202247191,0,2.4741988172043015,0,3]
["CBP/C",14262,"Revamp HVAC System in BCC Control Building","Completed","CTE/C","Gao Feng","Wang Wei",42131,42276,0,0,"H","ZNIC.009263","NZNIC014262K",null,14262,1216000,0,2093170,272607.06,835675.21,-91445,35750,1216000,"0",-39482.039999999666,1216000,1147477.27,-0.05635092927631578,272607.06,835675.21,39195,"0",0.036541709212053214,-0.06237254901960791,0,4.13704974271012,35750,0.29347826086956524,0,0]
["CGA",14255,"Add a Pair of Card Reader on the West Side Door of Visitor Center for Personnel Access Control","Completed","CTA/S","Dai Xiaolong","Qiu Wei",41941,42124,0,0,"N","ZNIF.632000.14.01","NZNIC014255K",null,14255,35000,0,35000,23850.88,0,-7900,4899.25,35000,"0",4790.92,35000,23850.88,-0.31854628571428567,23850.88,0,0,"0",0.005001250000000027,-0.40561964735516376,0,4.95,4899.25,0.18345833333333333,0,1]
["COO/C",14252,"Supply DMA from C1 Plant to BSNJ","Completed","CTE/P","Sun Duoxun/Liu Xiaoli","Xu Yefeng",41995,42246,0,0,"T_2015","ZNIC.008115","NZNIC014252K",null,14252,1767000,0,2019104,1429212.63,215773.95,-16820,-174931.56,1767000,"0",328005.39,1767000,1654986.5799999998,-0.06339186191284672,1429212.63,215773.95,10000,"0",-0.2362425673159533,-0.22417318775295136,0,1.0832673267326733,0,1.8659978217821782,0,1]
["CBL/O",14251,"Build a Operation Rest Room for ACN Loading Station","On Going","CTE/C","Yu Yi","Xu Zhaofeng",42222,0,0,0,"N","ZNIF.412790.15.01","NZNIC014251K",null,14251,338000,0,395234,15805,31139.76,47195,44000,338000,178675.22,-4844.98,338000,251649.97999999998,-0.25547343195266276,15805,31139.76,26030,178675.22,0.18250656951023997,{"$error":"#DIV/0!"},47195,0.25087301587301586,44000,0,0,0]
["CBP/C",14243,"Add a C5 Raffinate Pipe from YUANGANG Company to C5 Hydrogenation Reactor","Completed","CTE/P","Cao Lin","Ling Taizhong",42089,42253,0,0,"N","ZNIC.008902","NZNIC014243K",null,14243,3720000,0,3777568,2919128.48,0,7345,-56535.90000000002,3720000,"0",1988.579999999638,3720000,2976696.48,-0.1998127741935484,2919128.48,0,57568,"0",0.015619021102924045,-0.1434913509009737,7345,0.9744076655052265,0,1.1667725663716815,0,0]
["COA/L",14240,"Recover the BA Railway Loading Station","Completed","CTE/P","Zhu Jianxin","Wu Zefei",41995,42314,0,0,"H","ZNIC.008121","NZNIC014240K",null,14240,1907000,0,2176992,895845.41,3600,50540,45655.5,1907000,714445.3500000001,-8428.260000000082,1907000,1819232.7600000002,-0.04602372312532761,895845.41,3600,205342,714445.3500000001,0.05375047337233361,-0.25576874999999993,50540,0.8410691823899371,45655.5,0.7717225,0,0]
["CEP/E",14237,"LP Steam Rational Distribution and Utilization","On Going","CTE/P","Gu Jingfeng","Wu Zefei",42328,0,0,0,"N","ZNIC.011039","NZNIC014237K",null,14237,1763000,0,1843000,8800,401000,258200,303050,1763000,791950,0,1763000,1201750,-0.3183494044242768,8800,401000,0,791950,{"$error":"#DIV/0!"},{"$error":"#DIV/0!"},258200,0.008448540706605223,303050,0.021314387211367674,0,0]
["CEP/S",14235,"Add Safety Facilities for PS Burner Unit","On Going","CTE/A","Xiao Lixuan","Li Xueyong",42326,0,0,0,"N","ZNIF.105400.15.02","NZNIC014235K",null,14235,439000,0,439000,9900,180000,87000,49100,439000,113000,0,439000,302900,-0.3100227790432802,9900,180000,0,113000,{"$error":"#DIV/0!"},{"$error":"#DIV/0!"},87000,0,49100,0.16779661016949152,0,0]
["CAP/E",14234,"Add Anti-backflow facilities at LP Steam Header of MA/BA Plant","Completed","CTE/P","Zhu Jianxin","Wu Zefei",41983,42124,0,0,"T_2015","ZNIF.106300.14.01","NZNIC014234K",null,14234,893000,0,918516,857151.14,23515.86,-31445,-12263,893000,"0",298340.62,893000,880667,-0.013810750279955207,857151.14,23515.86,0,"0",-0.366418623519225,-0.18890871245911395,0,1.2002866242038217,0,1.1085221238938052,0,0]
["COA/E",14232,"Change the Breath Valve and Add a PSV for T9668","Completed","CTE/P","Xu Jin","Wang Yuncai",41963,42235,0,0,"N","ZNIF.106700.14.01","NZNIC014232K",null,14232,320000,0,349453,349453.42,0,-63340,-38225,320000,"0",-16307.599999999991,320000,349453.42,0.09204193749999995,349453.42,0,0,"0",0.1092752600989924,-0.10799633986928106,0,{"$error":"#DIV/0!"},0,{"$error":"#DIV/0!"},0,0]
["CAP/L",14230,"Add a Shed for A455 Truck Parking Lot","On Going","CTE/C","Yu Yi","Lu Jie",42256,0,0,0,"N","ZNIC.010285","NZNIC014230K",null,14230,1410000,0,1524250,48125,216717.94,64900,71500,1410000,663971.05,226440.01,1410000,1047159.99,-0.2573333404255319,48125,216717.94,118346,663971.05,-0.47175002083333334,{"$error":"#DIV/0!"},64900,0.24115755627009647,71500,0.2777777777777778,0,2]
["CEP/L",14227,"Rebuild the Existing Holding Device in PS Packing","Completed","CTE/P","Ding Juntao","Wang Yuncai",41977,42184,0,0,"N","ZNIF.175410.14.01","NZNIC014227K",null,14227,350000,0,354290,316498.34,1500,-4602.979999999996,8150,350000,"0",-20166.780000000013,350000,319598.34,-0.08686188571428564,316498.34,1500,1600,"0",0.11964151368473204,-0.23552076242341735,0,1.0605655263157894,8150,0.8188888888888889,0,2]
["CBL/O",14226,"Add a Unloading System for PALD in B305 Loading Station","Completed","CTE/P","Yu Xiya","Jiang Haijin",41976,42207,0,0,"T_2015","ZNIC.007948","NZNIC014226K",null,14226,1270000,0,1280313,885593.22,0,52634,-36350.119999999995,1270000,"0",135139.00000000006,1270000,893506.22,-0.29645179527559057,885593.22,0,7913,"0",-0.17699879395475773,-0.2522598020249621,52634,0.7680044077134986,0,1.2152805448623039,0,1]
["CBP/S",14222,"Add H2 Pipeline to BSNJ from Syngas Plant","Completed","CTE/P","Cao Lin","Ling Taizhong",42011,42277,0,0,"N","ZNIC.008171","NZNIC014222K",null,14222,1130000,559000,2285508,1715110.23,17.09,-95320,-76293.77000000002,1689000,"0",69393.75,1689000,1740127.32,0.03027076376554178,1715110.23,17.09,25000,"0",-0.010544857467935227,-0.06410582243675676,0,1.5519397799652577,0,1.2529005386591532,0,1]
["CBP/S",14218,"Modify Antisurge Control System of K1401","Completed","CTA/M","Cheng Guiyou","Gan Shuangfeng",41866,42116,42128,0,"T_2015","ZNIC.014218","NZNIC014218K",null,14218,1000000,0,1008800,782229.91,8800,3300,0,1000000,"0",44791.01000000001,1000000,791029.91,-0.20897008999999997,782229.91,8800,0,"0",-0.046657302083333345,{"$error":"#DIV/0!"},3300,0,0,{"$error":"#DIV/0!"},0,0]
["COA/A",14207,"Let-down MP Steam to LP Steam in GAA Plant","On Going","CTE/P","Zhu Jianxin","Wu Zefei",42265,0,0,0,"T_2015","ZNIC.010379","NZNIC014207K",null,14207,2362000,0,3206055,607640.92,563929.76,-119335,-44890,2362000,313946.3099999998,449579.8100000003,2362000,1912420.19,-0.19033861558001697,607640.92,563929.76,426903.2,313946.3099999998,-0.2813449724684136,{"$error":"#DIV/0!"},0,{"$error":"#DIV/0!"},0,{"$error":"#DIV/0!"},0,0]
["CBP/S",14200,"Add Control Valve at 1st Stage Inlet Nitrogen Line of K1701","Completed","CTE/P","Wang Can","Ling Taizhong",42048,41932,0,0,"N","ZNIF.104300.15.01","NZNIC014200K",null,14200,155000,0,174249,117753.86,0,-1445,11850,155000,"0",15654.940000000002,155000,117753.86,-0.24029767741935484,117753.86,0,0,"0",-0.31253875233372785,-0.32280907969785727,0,1.0283333333333333,11850,0.7109756097560975,0,0]
["CBL/O",14198,"Replace Manual Loading Arm Z2810&Z4802 with Pneumatic One","On Going","CTE/P","Yu Xiya","Xu Yefeng",42074,0,0,0,"T","ZNIF.412740.15.01","NZNIC014198K",null,14198,440000,0,466800,254976.42,24000,30305,32450,440000,83715.85999999999,11752.720000000001,440000,365492.28,-0.16933572727272722,254976.42,24000,2800,83715.85999999999,-0.048815397805751046,{"$error":"#DIV/0!"},30305,0.611474358974359,32450,0.2625,0,0]
["CBL/O",14197,"Replace Manual Loading Arm Z2203 with Pneumatic One","On Going","CTE/P","Yu Xiya","Xu Yefeng",42074,0,0,0,"T","ZNIF.651010.15.01","NZNIC014197K",null,14197,273000,0,294920,158227.76,0,22215,31250,273000,29837.859999999997,10269.379999999994,273000,209265.62,-0.23345926739926742,158227.76,0,21200,29837.859999999997,-0.08390449102192167,0.018819444444444382,22215,0.6826428571428571,31250,0.3055555555555556,0,0]
["COO/O",14194,"Add a Pump and Two On/off Valves for Val Loading","On Going","CTE/P","Liu Xiaoli","Jiang Haijin",42314,0,0,0,"N","ZNIC.010907","NZNIC014194K",null,14194,1260000,0,1412808,24200,126687.65,302500,238150,1260000,547914.81,20547.53999999998,1260000,698802.4600000001,-0.44539487301587294,24200,126687.65,0,547914.81,-0.12683666666666654,{"$error":"#DIV/0!"},302500,0,238150,0.09224318658280922,0,0]
["CBP/C",14187,"Add Pipeline to Send Light Fuel Oil to STT1310","On Going","CTE/P","Qiu Zhufeng","Ling Taizhong",41872,0,0,0,"T_2015","ZNIC.014187","NZNIC014187K",null,14187,4207000,2188000,5575289,5037001.23,531725.06,20846.609999999986,-59019.28000000003,{"$error":"#N/A"},{"$error":"#N/A"},{"$error":"#N/A"},6395000,{"$error":"#N/A"},{"$error":"#N/A"},5037001.23,531725.06,39112,{"$error":"#N/A"},{"$error":"#N/A"},-0.163453710691824,20846.609999999986,0.9001599137931036,0,1.1503963305090146,0,2]
["CEP/S",14182,"Rebuilt a Waste Liquid Storage","Completed","CTE/C","Gao Feng","Xia Weiguang",42131,42353,0,0,"H","ZNIF.105400.15.01","NZNIC014182K",null,14182,748000,0,1175500,308201.47,0,-78032.95999999999,-8650,748000,162600.00000000003,50298.53,748000,697701.47,-0.06724402406417115,308201.47,0,226900,162600.00000000003,{"$error":"#DIV/0!"},-0.2108069153394803,0,1.5911587878787878,0,1.1802083333333333,0,3]
["CTM",14173,"Technical Material Bar-code Management System","On Going","CFA/I","Tao Yang","Wang Jun",41803,0,0,0,"N","ZNIC.014173","NZNIC014173K",null,14173,2580000,0,4873537,0,2293536.92,0,0,2580000,286463.0800000001,0,2580000,2580000,0,0,2293536.92,0,286463.0800000001,{"$error":"#DIV/0!"},{"$error":"#DIV/0!"},0,{"$error":"#DIV/0!"},0,{"$error":"#DIV/0!"},0,0]
["CEP/E",14168,"Change an Online TOC Analyzer","On Going","CTA/S","Yong Jie","Yong Jie",41877,0,0,0,"N","ZNIC.014168","NZNIC014168K",null,14168,480000,0,480000,348420.96,0,-550,8800,480000,120779.03999999998,2000,480000,469200,-0.0225,348420.96,0,0,120779.03999999998,-0.005,{"$error":"#DIV/0!"},0,1.0714285714285714,8800,0,0,0]
["CBP/C",14165,"Add Pipe from BYC EBO Ship Loading Pipe to YPC G102 Tank","Completed","CTE/P","Qiu Zhufeng","Ling Taizhong",41842,42151,0,0,"H","ZNIC.014165","NZNIC014165K",null,14165,1143000,1448000,4095032,1592582.91,1500031.67,7680,-217067.97000000003,2591000,"0",1069078.940000001,2591000,3096614.58,0.1951426399073717,1592582.91,1500031.67,4000,"0",-0.42154116618616155,-0.21791784198622668,7680,0.8266365688487585,0,2.575525095264018,0,5]
["CBL/O",14163,"Replacement of 3 Low Efficiency Motors in A300 & RTTF","Canceled","CTA/L","Chen Kun","Chen Kun",41803,0,0,0,"N","ZNIC.014163","NZNIC014163K",null,14163,87789,0,87789,0,0,4400,35000,87789,48389,0,87789,48389,-0.4488033808335896,0,0,0,48389,{"$error":"#DIV/0!"},{"$error":"#DIV/0!"},4400,0,35000,0,0,0]
["CBP/C",14151,"Add New Pan Oil Pipe from Pan oil Pump to Ethylene Bottom Oil Pipe","Completed","CTE/P","Sun Aihong","Ling Taizhong",42017,42352,0,0,"T_2015","ZNIF.104100.15.01","NZNIC014151K",null,14151,410000,0,483095,374983.24,0,-1425,-36825,410000,-18537.019999999968,51553.77999999998,410000,358446.22000000003,-0.1257409268292682,374983.24,0,2000,-18537.019999999968,-0.11892832065273223,-0.41124890425025673,0,1.0182692307692307,0,1.4976351351351351,0,0]
["All",14149,"BYC Electrical Monitoring & Control System (EMCS) Migration","Completed","CTA/VO","Gu Hemei","Sun Zhongpin",41795,42114,42306,0,"T_2015","ZNIC.014149","NZNIC014149K",null,14149,9740000,0,9742700,7151007.15,0,-376977.24,-47306,9740000,"0",1289086.7300000014,9740000,7151007.15,-0.26581035420944554,7151007.15,0,0,"0",-0.14725482356791544,-0.16389291386550056,0,2.6799342245989304,0,1.8776623376623376,0,3]
["CEP/S",14144,"Add PIB Tank and Feed System in HIPS Plant","On Going","CTE/P","Gu Jingfeng","Wu Zefei",41981,0,0,0,"H","ZNIC.008007","NZNIC014144K",null,14144,6240000,0,10167086,2987057.18,2850148.21,-96586.63,-140434.59999999998,6240000,-670510.3300000003,165282.94000000012,6240000,6074717.0600000005,-0.026487650641025557,2987057.18,2850148.21,908022,-670510.3300000003,-0.028384722544031012,-0.22694920502221605,0,1.1856721068819684,0,1.3793991625016884,1,8]
["CBL/P",14141,"Add a Manual Sampler on the NAP Feed Piping from YPC","On Going","CTE/P","Li Shouqing","Jiang Haijin",42083,0,0,0,"N","ZNIF.604170.15.01","NZNIC014141K",null,14141,497000,0,600931,298326.77,95439.15,9805,24825,497000,138245.09,-121441.01000000001,497000,583811.01,0.17467004024144872,298326.77,95439.15,51800,138245.09,0.6897067350915485,{"$error":"#DIV/0!"},9805,0.9066190476190477,24825,0.6349264705882353,0,0]
["CBP/A",14126,"Add ESD Interlock Signal and Block Valve for 410-R101A/B","Completed","CTE/A","Gong Feibao","Li Hong",41857,42123,0,0,"T_2015","ZNIC.014126","NZNIC014126K",null,14126,191000,0,207000,194143.69,0,-23330,-4403,191000,"0",7768.200000000023,191000,194143.69,0.01645910994764399,194143.69,0,0,"0",-0.04719798269910637,-0.44343521171601397,0,1.831729055258467,0,1.1416894609814965,0,0]
["CBP/C",14121,"H109 Convection Section Modification","Completed","CTE/P","Zhou Yanduo","Ling Taizhong",41850,42151,42193,0,"T_2015","ZNIC.014121","NZNIC014121K",null,14121,16490000,0,16492000,15521887.68,0,18180,-193590.95999999996,16490000,"0",13222412.33,16490000,15523887.68,-0.058587769557307476,15521887.68,0,2000,"0",-0.8315529424709212,0.015529772151212443,18180,0.9004381161007667,0,1.6229797586484311,0,0]
["CBP/M",14115,"Replacement of 16 Low Efficiency Motors in EB/SM Plant","Completed","CTA/M","Lv Yong","Lv Yong",41808,42199,0,0,"N","ZNIC.014115","NZNIC014115K",null,14115,873000,0,875000,352861.92,2000,0,138240,873000,"0",146828.34000000003,873000,354861.92,-0.5935144100801832,352861.92,2000,0,"0",-0.3085937915558511,0.02773245901639333,0,{"$error":"#DIV/0!"},138240,0.04,0,0]
["CHA",14112,"EPS Replacement for Z100 1st and 2nd Floor","Completed","CTE/A","Bian Jiacai","Chen Gang",41796,42094,0,0,"N","ZNIC.014112","NZNIC014112K",null,14112,284000,0,309000,147730.98,0,5075,-10725,284000,"0",74872,284000,172730.98,-0.3917923239436619,147730.98,0,25000,"0",-0.4404235294117647,{"$error":"#DIV/0!"},5075,0.8306922435362802,0,1.3482142857142858,0,0]
["CEP/S",14107,"PS/EPS Plant Emergency Lighting Modification","On Going","CTE/A","Xu Zheng","Zhang Pu",42209,0,0,0,"H","ZNIC.009924","NZNIC014107K",null,14107,1329000,0,2128389,199141.15,631642.51,-2522.6399999999994,55700,1329000,-149498.42999999993,83393.27000000003,1329000,1189906.7300000002,-0.10466009781790804,199141.15,631642.51,508621.5,-149498.42999999993,-0.11706354894162377,-0.05660392156862751,0,1.0413547540983605,55700,0.05593220338983051,0,2]
["COO/A",14104,"Add a Pipeline of ACN Waste Liquid to U5 Incinerator","On Going","CTE/P","Li Shouqing","Jiang Haijin",42025,0,0,0,"N","ZNIC.008275","NZNIC014104K",null,14104,2063000,0,2151486,1462802.23,700.1,-16000,-207203.71999999997,{"$error":"#N/A"},{"$error":"#N/A"},{"$error":"#N/A"},2063000,{"$error":"#N/A"},{"$error":"#N/A"},1462802.23,700.1,594078,{"$error":"#N/A"},{"$error":"#N/A"},-0.19373093238495157,0,1.0883977900552486,0,2.606230387596899,0,1]
["CTS/U",14101,"Replacement of ID Fans_Phase II CLWI Modification","Completed","CTE/P","Zhou Yanduo","Jiang Haijin",41757,42129,0,0,"T_2015","ZNIC.014101","NZNIC014101K",null,14101,6213000,0,6354998,5851828.53,0,-69218.57999999996,-403842.1,6213000,"0",-1007216.2099999997,6213000,5897328.53,-0.05080821986158052,5851828.53,0,45500,"0",0.3553655372250509,-0.036126935175382874,0,1.1353246920821114,0,2.501550845882134,0,9]
["CBP/C",14097,"Add Fire Water Sprinkler Facilities for Pumps","Completed","CTE/P","Zhang Fanwen","Ling Taizhong",41842,42285,0,0,"H","ZNIC.014097","NZNIC014097K",null,14097,1229000,0,1543231,1245208.14,3291.45,-11319.200000000012,-33375.29999999999,1229000,"0",20176.139999999898,1229000,1344891.5899999999,0.094297469487388,1245208.14,3291.45,96392,"0",-0.043069959650895134,0.02406523488582641,0,1.0616178551986937,0,1.1673996238244513,0,1]
["CBP/C",14091,"APC Implementation and Optimization of Ethylene Unit","On Going","CTA/S","Dai Xiaolong","Dai Xiaolong",41717,0,0,0,"N","ZNIC.014091","NZNIC014091K",null,14091,11000000,0,13751277,1673216.16,2159010.01,-1082605.88,165800,11000000,6577180.359999999,424793.47000000067,11000000,10409406.53,-0.053690315454545515,1673216.16,2159010.01,0,6577180.359999999,-0.10461347337831864,{"$error":"#DIV/0!"},0,4.608686266666666,165800,0.44733333333333336,3,0]
["COO/A",14088,"Increase the Yield of Product AEEA","Completed","CTE/P","Li Shouqing","Jiang Haijin",41995,42286,0,0,"T_2015","ZNIF.107830.14.01","NZNIC014088K",null,14088,494000,0,665445,386739.66,58119.66,-4610,1925,494000,"0",10816.099999999999,494000,446209.31999999995,-0.09674226720647784,386739.66,58119.66,1350,"0",0.010746800578005056,-0.18329217522272276,0,1.037479674796748,1925,0.978125,0,1]
["CCP/O",14087,"Add On/off Valves for HV24201/HV44201","Completed","CTE/A","Wang Zhen","Wang Xinwu",41793,42132,0,0,"T_2015","ZNIC.014087","NZNIC014087K",null,14087,490000,140000,634555,633055.06,0,-7700,-48813.06000000001,490000,"0",-194772.13,630000,634555.06,0.007230253968254057,633055.06,0,1500,"0",1.8186709290124499,-0.424264569533658,0,1.0557768924302788,0,1.9646849802371544,0,2]
["CEP/P",14086,"Replacement of AMOT by Sentry System","Completed","CTE/A","Wang Zhen","Li Xueyong",41778,42131,0,0,"T_2015","ZNIC.014086","NZNIC014086K",null,14086,5612000,0,6213122,5708132.27,0,79750,40422,5612000,"0",210924.66000000061,5612000,5708132.27,0.01712977013542401,5708132.27,0,0,"0",-0.029661227345639616,-0.2634009375352988,79750,0.6881720430107527,40422,0.7123501156377868,0,0]
["CBP/C",14072,"Add 7 Samplers for Quench Section of Cracker","Completed","CTE/P","Qiu Zhufeng","Ling Taizhong",41842,42133,0,0,"T_2015","ZNIC.014072","NZNIC014072K",null,14072,593000,0,693000,595389.97,0,7760,16329.11,593000,"0",-42106.55,593000,595389.97,0.004030303541315299,595389.97,0,0,"0",0.16674457440543777,-0.10272199999999994,7760,0.9170053475935829,16329.11,0.8773169797145004,0,0]
["CBP/M",14068,"Replace Samplers for EB/SM","Completed","CTE/P","Sun Aihong","Wu Zefei",41862,42124,0,0,"T_2015","ZNIC.014068","NZNIC014068K",null,14068,485000,0,532500,554464.44,0,14200,23064.83,485000,"0",182574.70000000016,485000,554464.44,0.14322564948453598,554464.44,0,0,"0",-0.4955975551913327,0.12344666666666672,14200,0.8013986013986014,23064.83,0.7015227434487221,0,0]
["CBP/M",14067,"Replace Some Pumps for EB/SM","On Going","CTE/P","Wang Lifen","Ling Taizhong",41866,0,0,0,"N","ZNIC.014067","NZNIC014067K",null,14067,1900000,0,2603495,1404372.79,2897.44,-72464.76000000001,-120389.16000000003,1900000,-529481.0500000002,439999.8200000001,1900000,1460000.1799999997,-0.2315788526315791,1404372.79,2897.44,582211,-529481.0500000002,-0.33366759192269924,-0.2991658945432684,0,1.3541777126099708,0,1.4667150998255478,9,8]
["CBP/M",14066,"Revamp Outlet Motor Valves of Cooling Water Pumps","Completed","CTE/A","Gong Feibao","Li Hong",41843,42117,0,0,"T_2015","ZNIC.014066","NZNIC014066K",null,14066,1380000,0,1446000,1066525.31,0,-21295,-9865.429999999993,1380000,"0",1291047.2,1380000,1066525.31,-0.22715557246376808,1066525.31,0,0,"0",-0.6314905878827333,-0.14336903967989326,0,1.1253015592821418,0,1.0540275465498357,0,0]
["CBP/B",14058,"Move the BD&IB Plant DCS Control Station from BCC to EBSM","Completed","CTE/A","Gong Feibao","Li Hong",41870,42115,0,0,"T_2015","ZNIC.014058","NZNIC014058K",null,14058,3400000,0,3410505,2704774.17,0,-151971.82,-98115.5,3400000,"0",781486.6600000001,3400000,2708079.17,-0.20350612647058824,2704774.17,0,3305,"0",-0.27149757211615744,-0.3044872941115733,0,1.5344533849129594,0,1.236280553883203,0,7]
["CEP/E",14051,"Natural Gas Flowmeter Modification","Completed","CTE/P","Gu Jingfeng","Wu Zefei",41715,41886,0,0,"T","ZNIC.014051","NZNIC014051K",null,14051,157000,0,158500,111094.64,0,4950,19189.920000000002,157000,"0",321.4400000000005,157000,112594.64,-0.2828366878980892,111094.64,0,1500,"0",0.11807789473684208,-0.64123,4950,0.9262295081967213,19189.920000000002,0.577081652892562,0,1]
["CBP/C",14045,"Add Gas Detector around Liquid Hydrocarbon Pumps","Completed","CTE/A","Wang Zhen","Li Hong",41836,42194,0,0,"N","ZNIC.014045","NZNIC014045K",null,14045,491000,0,503000,342262.57,0,-8800,-6600,491000,"0",18860.839999999997,491000,354262.57,-0.27848763747454175,342262.57,0,12000,"0",0.0356331172172731,-0.32467755660022046,0,1.0914285714285714,0,1.0923076923076922,0,0]
["CBP/M",14035,"Revamp H1203 Natural Gas Pipeline","Completed","CTE/P","Sun Aihong","Wu Zefei",41796,42124,0,0,"T_2015","ZNIC.014035","NZNIC014035K",null,14035,418000,0,419200,372951.79,0,-5310,31263.399999999994,418000,"0",32076.6,418000,372951.79,-0.10777083732057421,372951.79,0,0,"0",-0.09670133017770899,-0.28002273062730626,0,1.0412587412587413,31263.399999999994,0.6976460348162477,0,0]
["CBP/M",14034,"Add an Inhibitor Surge Drum for Each of T2401/2403","Completed","CTE/P","Sun Aihong","Wu Zefei",41841,42255,0,0,"T_2015","ZNIC.014034","NZNIC014034K",null,14034,477000,0,542736,549736.16,0,-24420,-56351.669999999984,477000,"0",70420.5,477000,549736.16,0.1524867085953879,549736.16,0,0,"0",-0.14459733651459875,-0.38481376645549714,0,1.2065116279069767,0,1.401008148016367,0,2]
["CBP/M",14033,"Add O2 Detector at Discharge of C2401","Completed","CTE/A","Gong Feibao","Li Hong",41830,42312,0,0,"T_2015","ZNIC.014033","NZNIC014033K",null,14033,246000,0,352085,245105.55,130,-9222.070000000007,-30253,246000,13175.870000000017,-12411.420000000006,246000,258411.42,0.050452926829268344,245105.55,130,0,13175.870000000017,0.12231137244111787,-0.076076396319281,0,1.1581830188679247,0,1.8462377622377621,7,0]
["CBP/M",14031,"380VAC LV MCC System Modification of EB/SM","Completed","CTE/A","Zhao Wei","Sun Zhongpin",41795,42132,42303,0,"T_2015","ZNIC.014031","NZNIC014031K",null,14031,12200000,0,12485476,8396184.58,0,113179.14000000013,-210620.5,{"$error":"#N/A"},"0",{"$error":"#N/A"},12200000,8663660.38,-0.28986390327868844,8396184.58,0,267475.8,"0",{"$error":"#N/A"},-0.31299561659959707,113179.14000000013,0.9159737629459147,0,1.5918800056203457,0,12]
["CBP/C",14023,"Expand the Capacity of 330-V-344","Completed","CTE/P","Qiu Zhufeng","Ling Taizhong",41794,42133,0,0,"T_2015","ZNIC.014023","NZNIC014023K",null,14023,497000,100000,574600,574600.02,0,12126.100000000006,-6871.169999999984,597000,"0",147937.95000000007,597000,574600.02,-0.03752090452261304,574600.02,0,0,"0",-0.3636367819985128,-0.22101803039816156,12126.100000000006,0.9179698968374768,0,1.0515853603603602,0,4]
["COA/S",14015,"E1210 Condensate Recycle","On Going","CTE/P","Zhu Jianxin","Wu Zefei",42019,0,0,0,"N","ZNIF.106500.15.01","NZNIC014015K",null,14015,830000,290000,854477,425970.85,48000,154110,122850,1120000,350815.76,11981.39000000002,1120000,831058.61,-0.25798338392857145,425970.85,48000,6272,350815.76,-0.04233311395379022,-0.174525,154110,0.5138485804416404,122850,0.19177631578947368,0,1]
["CTS/U",14002,"Replace Material of the Pipeline between Compressor and Dryer","Completed","CTE/P","Li Shouqing","Zhang Fanwen",41752,42118,0,0,"T_2015","ZNIC.014002","NZNIC014002K",null,14002,2360000,0,2377500,2165099.84,0,-18560,-77089.53,2360000,"0",-448100.20999999996,2360000,2182599.84,-0.07516955932203397,2165099.84,0,17500,"0",0.5472564070888835,0.04618305274253007,0,1.1417876241405653,0,1.4421538858617724,0,0]
["CTS/U",14001,"Add Heat Exchanger of CPS Pipeline to BCC","Completed","CTE/P","Li Shouqing","Zhang Fanwen",41793,42124,0,0,"T_2015","ZNIC.014001","NZNIC014001K",null,14001,1194000,0,1344261,1032623.23,8000,-21256.47999999998,2578.2999999999884,1194000,"0",124067.15000000008,1194000,1042884.23,-0.12656262144053604,1032623.23,8000,2261,"0",0.013642027028265512,-0.2973925408992106,0,1.125480991735537,2578.2999999999884,0.9846803327391563,0,2]
["CBP/A",13277,"D230 MCC Modification","Completed","CTE/A","Hu Xiao","Chen Gang",41764,42132,0,0,"T_2015","ZNIC.013277","NZNIC013277K",null,13277,3950000,0,3964380,2035043.68,4498,-72400.52000000002,91817.32,{"$error":"#N/A"},"0",{"$error":"#N/A"},3950000,2041923.68,-0.4830572962025317,2035043.68,4498,2382,"0",{"$error":"#N/A"},0.03675722682019908,0,1.4044156961318253,91817.32,0.6536502451904941,0,4]
["CBP/M",13270,"Gas Detector Modification for EB/SM Tank Farm","Completed","CTE/A","Wang Zhen","Li Hong",41709,42250,0,0,"N","ZNIC.013270","NZNIC013270K",null,13270,432000,0,432000,243654.64,0,-580,-2475,432000,"0",87683.35999999999,432000,243654.64,-0.4359846296296296,243654.64,0,0,"0",-0.433782753655122,-0.23445411583160533,0,1.0082386363636364,0,1.0535714285714286,0,0]
["CHA",13265,"Modify IET Office to Archive Centre Storeroom","Completed","CTE/C","Yu Yi","Jiang Yunning",41926,42063,42251,0,"N","ZNIC.007512","NZNIC013265K",null,13265,1221000,1600000,2851000,2301084.59,30000,4252.389999999999,-380587.92,2821000,"0",208666.36999999976,2821000,2331084.59,-0.1736672846508331,2301084.59,30000,0,"0",-0.345407319514099,-0.1211815043293436,4252.389999999999,0.9537783695652174,0,4.174211175979983,0,3]
["COA/E",13263,"Add Solenoid Valve for P5845 and P6660/P6665 Diaphragm Pump Air Supply","Completed","CTA/A","Guo Jinhua","Guo Jinhua",41661,42246,0,0,"N","ZNIC.013263","NZNIC013263K",null,13263,70000,0,70000,0,0,0,1500,70000,"0",0,70000,0,-1,0,0,0,"0",{"$error":"#DIV/0!"},{"$error":"#DIV/0!"},0,{"$error":"#DIV/0!"},1500,0,0,0]
["CBP/C",13260,"Upgrade PLC of Turbonmachinery Control System","Completed","CTA/B","Zhao Yongming","Zhao Yongming",41619,42155,42152,0,"T_2015","ZNIC.013260","NZNIC013260K",null,13260,2000000,0,2000000,1276119.98,0,75600,0,2000000,"0",490020.6200000001,2000000,1276119.98,-0.36194001000000003,1276119.98,0,0,"0",-0.24774379111931502,{"$error":"#DIV/0!"},75600,0.055,0,{"$error":"#DIV/0!"},0,0]
["CBP/C",13259,"Upgrade Speed Control System of Compressors","Completed","CTA/B","Zhao Yongming","Zhao Yongming",41619,42155,42152,0,"T_2015","ZNIC.013259","NZNIC013259K",null,13259,2000000,0,2000000,1838951.56,0,80000,0,2000000,"0",-201573.33999999985,2000000,1838951.56,-0.08052421999999997,1838951.56,0,0,"0",0.10337094358974351,{"$error":"#DIV/0!"},80000,0,0,{"$error":"#DIV/0!"},0,0]
["CBP/M",13257,"Add a Waste Water Pump in EB/SM","Completed","CTE/P","Sun Aihong","Ling Taizhong",41709,42349,0,0,"N","ZNIC.013257","NZNIC013257K",null,13257,365000,0,445854,376522.83,0,11640,-11766.220000000001,365000,-56587.31000000004,26424.480000000025,365000,326935.51999999996,-0.10428624657534258,376522.83,0,7000,-56587.31000000004,-0.07490738217401803,-0.1351577502389007,11640,0.8856019656019656,0,1.1506558258642765,0,1]
["CBP/C",13247,"Modification of Filter System for P230","Completed","CTE/P","Wang Can","Ling Taizhong",41830,42133,0,0,"T_2015","ZNIC.013247","NZNIC013247K",null,13247,1055000,495000,1485801,1620413.84,101,-65730.08999999997,-9245.609999999986,1055000,"0",-586764.3300000002,1550000,1620514.84,0.04549344516129038,1620413.84,101,0,"0",0.8814700630913824,-0.13412816661458285,0,1.3265783106191216,0,1.0579571227080393,1,3]
["CBP/B",13244,"Add Spare Exchangers and Filters in BEU","Completed","CTE/P","Gu Jingfeng","Ling Taizhong",41709,42223,0,0,"T_2015","ZNIC.013244","NZNIC013244K",null,13244,5250000,0,5251931,3330289.88,431.09,-325563.53,-170071.53000000003,5250000,"0",1619190.82,5250000,3332220.9699999997,-0.3652912438095239,3330289.88,431.09,1500,"0",-0.4480039321667058,-0.18288445515087043,0,1.8130957292707293,0,1.5622199338842977,0,7]
["CEP/S",13243,"Revamp Rain Drainage System of PS Tank Farm","Completed","CTE/C","Gao Feng","Zhang Zhihe",41841,42236,0,0,"H","ZNIC.013243","NZNIC013243K",null,13243,561000,0,598204,594203.35,0,32768.20000000001,-19676.259999999995,561000,"0",49509.95999999999,561000,598203.35,0.06631613190730834,594203.35,0,4000,"0",-0.037725653115574576,-0.1861856843316339,32768.20000000001,0.8161156004489337,0,1.194959227148873,0,3]
["CAP/E",13240,"Add Jacket Heat Exchanger on V6700","Completed","CTE/P","Xie Qiang","Wu Zefei",41656,41886,0,0,"N","ZNIC.013240","NZNIC013240K",null,13240,410000,0,437708,436207.83,0,-5905,-20524.440000000002,{"$error":"#N/A"},"0",{"$error":"#N/A"},410000,437707.83,0.06758007317073175,436207.83,0,1500,"0",{"$error":"#N/A"},-0.27267036731988553,0,1.0547773654916512,0,1.241535039717564,0,1]
["CBL/O",13236,"Rebuild RTTF Operation Room 1&2","Completed","CTE/C","Yu Yi","Guo Bing",41893,42308,0,0,"N","ZNIC.013236","NZNIC013236K",null,13236,942000,0,1383028,384367.86,10029.9,-6810,33188.45,942000,108373.06000000001,-24642.27000000002,942000,933453.8200000001,-0.009072377919320525,384367.86,10029.9,430683,108373.06000000001,0.5092160197250196,-0.38720429950277846,0,1.0483664772727272,33188.45,0.7464595110771581,0,3]
["CBP/A",13234,"Replacement of 800-UPS-001","Completed","CTE/A","Bian Jiacai","Chen Gang",41666,42110,0,0,"T_2015","ZNIC.013234","NZNIC013234K",null,13234,774000,0,774000,494014.8,0,1251.8899999999994,-4677,774000,"0",129054.19,774000,494014.8,-0.36173798449612404,494014.8,0,0,"0",-0.21640256602516036,0.04820710337527939,1251.8899999999994,0.974849020592667,0,1.2074057649667407,0,3]
["CBP/C",13233,"Replacement of 300-UPS-001","Completed","CTE/A","Bian Jiacai","Chen Gang",41666,42117,0,0,"T_2015","ZNIC.013233","NZNIC013233K",null,13233,881000,0,881000,566235.58,0,11560,-2795.880000000001,881000,"0",127408.53,881000,566235.58,-0.3572808399545971,566235.58,0,0,"0",-0.18571428571428572,0.17742503080925656,11560,0.767754897036665,0,1.1239858093126387,0,2]
["CBP/C",13229,"Replace Economizer with High Efficient Type for SUB","Completed","CTE/P","Qiu Zhufeng","Ling Taizhong",41743,42130,0,0,"T_2015","ZNIC.013229","NZNIC013229K",null,13229,3054000,1553000,4073939,4279187.91,0,-21153.97,-14625,3054000,"0",-196768.88000000012,4607000,4319187.91,-0.06247277838072495,4279187.91,0,40000,"0",0.04776466222247677,0.04667500000000002,0,1.1236712657117802,0,1.1007231404958677,1,0]
["CCP/A",13224,"Add 2000m3 DEOA Tank in RTTF","Completed","CTE/P","Jiang Hao/Liu Xiaoli","Xu Yefeng/Zong Baorong",41697,42129,0,0,"T_2015","ZNIC.013224","NZNIC013224K",null,13224,15880000,0,16101960,17613149.76,36292.33,332800,202300,15880000,"0",-54575.10000000056,15880000,17649442.09,0.11142582430730477,17613149.76,36292.33,0,"0",0.5639710571418174,-0.27372533829499324,332800,0,202300,0.18950320512820512,0,0]
["CTS/U",13209,"Adding a New Ultrasonic Flowmeter on DM Water in CLWI","Hold","CTA/U","Yu Yong","Yu Yong",41557,0,0,0,"N","ZNIC.013209","NZNIC013209K",null,13209,90000,0,213215,0,123215.39,0,5000,90000,-38215.39,0,90000,85000,-0.05555555555555555,0,123215.39,0,-38215.39,{"$error":"#DIV/0!"},{"$error":"#DIV/0!"},0,{"$error":"#DIV/0!"},5000,0,0,0]
["COO/C",13198,"NPG_TMA Supply from C1 Plant","Completed","CTE/P","Sun Duoxun","Jiang Haijin",41528,42160,0,0,"T_2015","ZNIC.131198","NZNIC013198K",null,13198,1676000,0,2185329,2195537.55,0,-352510.27,-287309.01,1676000,"0",129032.34000000014,1676000,2201537.55,0.31356655727923616,2195537.55,0,6000,"0",-0.31387695278994304,4.2945492578353615E-3,0,{"$error":"#DIV/0!"},0,{"$error":"#DIV/0!"},0,4]
["COO/O",13197,"NPG_IBA Supply from OXO Plant","Completed","CTE/P","Sun Duoxun","Jiang Haijin",41528,42158,0,0,"T_2015","ZNIC.131197","NZNIC013197K",null,13197,1720000,0,2319011,2315658.3,5000,-345333.97,-276334.4,1720000,"0",328807.09,1720000,2326658.3,0.3527083139534883,2315658.3,5000,6000,"0",-0.3909712835423861,-0.17224221986828764,0,{"$error":"#DIV/0!"},0,{"$error":"#DIV/0!"},0,3]
["CBP/M",13195,"Replace an Air Dryer","On Going","CTE/P","Ding Juntao","Ling Taizhong",41997,0,0,0,"N","ZNIC.008126","NZNIC013195K",null,13195,1344000,0,1596491,949744.01,462.5,-49443.01999999999,-27500,1344000,-34100.24000000008,171914.73000000007,1344000,1172085.27,-0.12791274553571427,949744.01,462.5,255979,-34100.24000000008,-0.1929626527370442,-0.4685241379310344,0,1.363953036437247,0,1.196078431372549,0,6]
["CBP/C",13190,"Add Explosion-proof Monitoring Camera in BCC&SCTF","Completed","CTE/A","Bian Jiacai","Chen Gang",41680,42185,0,0,"N","ZNIC.013190","NZNIC013190K",null,13190,5665000,0,5675760,4203228.63,0,2820,-18150,5665000,"0",1068608.1800000002,5665000,4203228.63,-0.25803554633715803,4203228.63,0,0,"0",-0.23695357186936444,-0.05855974151254571,2820,0.986235509456986,0,1.0666666666666667,0,0]
["CBP/M",13189,"Air-conditioning System Modification in CCR of 7100","Completed","CTE/C","Gao Feng","Wang Wei",41667,42185,0,0,"N","ZNIC.013189","NZNIC013189K",null,13189,4234000,0,4398544,3008109.75,20095,-54198.119999999995,9568.869999999995,{"$error":"#N/A"},"0",{"$error":"#N/A"},4234000,3041789.75,-0.2815801251771375,3008109.75,20095,13585,"0",{"$error":"#N/A"},-0.19355968256565495,0,1.2324104631217838,9568.869999999995,0.9414210590756046,0,2]
["CBP/M",13184,"Modify Waste Water System for EB/SM Tank Farm","Completed","CTE/P","Sun Aihong","Ling Taizhong",41753,42314,0,0,"T_2015","ZNIC.013184","NZNIC013184K",null,13184,4080000,0,4814735,3070395.75,52079.48,-20197.27000000002,-169055.05,4080000,-593648.48,1233088.25,4080000,2846911.75,-0.30222751225490196,3070395.75,52079.48,318085,-593648.48,-0.3579345312606359,-0.21212506535294845,0,1.0745630641439778,0,1.477286984754376,0,5]
["CEP/S",13165,"Control System of Pelletizing Upgrading in HIPS","Completed","CTE/A","Gong Feibao","Zeng Qing",41591,42152,0,0,"T_2015","ZNIC.013165","NZNIC013165K",null,13165,1139000,91000,1404921,1404921.44,0,58600,77500,1139000,"0",-640000,1230000,1404921.44,0.14221255284552842,1404921.44,0,0,"0",0.6666666666666666,{"$error":"#DIV/0!"},58600,0.38958333333333334,77500,0,0,0]
["CBP/C",13156,"Add a Control Valve on K650 Outlet Line to Flare","Completed","CTE/P","Qiu Zhufeng","Li Hong",41625,42122,0,0,"T_2015","ZNIC.013156","NZNIC013156K",null,13156,340000,0,390000,204932.78,0,22600,-9034.339999999997,340000,"0",37188.48000000002,340000,204932.78,-0.3972565294117647,204932.78,0,0,"0",-0.2275029403048052,-0.4270674932000759,22600,0.6712727272727272,0,1.2119493255131963,0,0]
["CAP/A",13133,"Add New Restab Unit System","Completed","CTE/P","Zhu Jianxin","Wu Zefei",41663,41989,0,0,"H","ZNIC.013133","NZNIC013133K",null,13133,8751000,0,10339693,5873055.08,1583692.53,-619842.0199999998,-265472.81000000006,8751000,"0",1411008.29,8751000,7461747.61,-0.14732629299508623,5873055.08,1583692.53,5000,"0",-0.2634002085671671,-0.333734628793946,0,2.014471391162029,0,1.3692250486787205,9,7]
["CBP/M",13120,"EB/SM Plant Paging System Modification","Completed","CTA/S","Dai Xiaolong","Qiu Wei",41465,42185,0,0,"N","ZNIC.013120","NZNIC013120K",null,13120,950000,0,963899,914799.43,0,-4714,4950.580000000002,950000,"0",-159529.90000000002,950000,928698.43,-0.02242270526315784,914799.43,0,13899,"0",0.2408857142857143,-0.067334074074074,0,1.4714,4950.580000000002,0.8349806666666666,0,1]
["CEP/S",13115,"PS&EPS Plant Paging System Modification","Completed","CTA/S","Dai Xiaolong","Qiu Wei",41465,42185,0,0,"H","ZNIC.013115","NZNIC013115K",null,13115,1050000,0,1050000,952566.79,0,-18875,30000,1050000,"0",-143097.13,1050000,952566.79,-0.0927935333333333,952566.79,0,0,"0",0.20006625,-0.14744234782608692,0,2.8875,30000,0,0,0]
["CEP/S",13114,"Add Back Flow Protection in Utility Supply Pipes","Completed","CTE/P","Gu Jingfeng","Zhang Fanwen",41515,42129,0,0,"T_2015","ZNIC.013114","NZNIC013114K",null,13114,1996000,0,1999111,1128415.8,3111.11,-45660.51000000001,-17168.869999999995,1996000,"0",618079.7700000001,1996000,1131526.9100000001,-0.43310275050100194,1128415.8,3111.11,0,"0",-0.7247746876472724,-0.20944783236445155,0,1.2758109936575053,0,1.0960496223776224,0,2]
["CTS/U",13112,"CLWI Modification","Completed","CTE/P","Zhou Yanduo","Zhang Fanwen",41582,42017,42195,0,"H","ZNIC.013112","NZNIC013112K",null,13112,16000000,0,16045806,12367299.12,0,-7723526.8100000005,-493586.35,16000000,"0",1068187.919999999,16000000,12406352.62,-0.22460296125000004,12367299.12,0,39053.5,"0",-0.05845784352182098,-0.22807791464742422,0,31.894107240000004,0,3.35041119047619,6,15]
["CCP/A",13106,"Add a EDA Recycle Pump to Produce More PIP/DETA","Completed","CTE/P","Li Shouqing","Wang Wei",41493,41882,0,0,"T","ZNIC.013106","NZNIC013106K",null,13106,1715000,0,1715000,1479893,0,17614.53,-115361.37,1715000,"0",247600.61,1715000,1479893,-0.13708862973760932,1479893,0,0,"0",-0.1883555867164932,-0.2687430769230768,17614.53,0.931713394068618,0,1.8389917818181818,0,2]
["CBP/C",13105,"Add a Gasoline Reflux Pump for Quench Oil Fractionator","Canceled","CTE/P","Sun Aihong","Ling Taizhong",41678,0,0,0,"T_2015","ZNIC.013105","NZNIC013105K",null,13105,1947000,0,1947000,203571.98,0,143495,239487.52000000002,1947000,1289016.15,71429.35,1947000,1492588.13,-0.23339079096045204,203571.98,0,0,1289016.15,-0.036221877835396266,-0.7775663745892661,143495,0.4631687242798354,239487.52000000002,0.18074909775079107,0,0]
["CTA",13096,"C402 HVAC Replacement and Roof Repair","Completed","CTE/C","Yu Yi","Wang Wei",41603,42040,0,0,"N","ZNIC.013096","NZNIC013096K",null,13096,2660000,0,2668000,1792039.75,8000,-49810,-426602.39,2660000,"0",678663.9,2660000,1800039.75,-0.32329332706766917,1792039.75,8000,0,"0",-0.4295670943902053,-0.153283372560952,0,1.259494660067726,0,3.3647582594235033,0,2]
["CBP/C",13081,"Replace the Electric Heat Tracing on Furnaces","On Going","CTE/A","Wang Zhen","Li Hong",41521,0,0,0,"T_2015","ZNIC.013081","NZNIC013081K",null,13081,3238000,0,3564454,2598843.26,8477.26,-19825,-314050,3238000,-73734.40999999963,409516.88999999984,3238000,2828483.11,-0.1264721710932675,2598843.26,8477.26,294897,-73734.40999999963,-0.24299986193839684,-0.1328543151969981,0,1.045627157652474,0,1.5947916666666666,0,0]
["CEP/L",13064,"Fire Alarm System Modification in PS/EPS Logistics","Completed","CTE/A","Hu Xiao","Zhang Pu",41519,41786,0,0,"H","ZNIC.013064","NZNIC013064K",null,13064,977000,0,987740,987739.89,0,-27880.01000000001,16225,977000,"0",36997.21000000002,977000,987739.89,0.010992722620266135,987739.89,0,0,"0",-0.05324297600259919,-0.04121423428913943,0,1.2325271893244372,16225,0.9118086696562033,0,2]
["CBP/C",13060,"Add Two Inhibiter Injection Pumps","Completed","CTE/P","Sun Aihong","Ling Taizhong",41724,42133,0,0,"T_2015","ZNIC.013060","NZNIC013060K",null,13060,650000,0,685000,614689.9,0,-1995,36765.83,650000,"0",-44714.46999999994,650000,614689.9,-0.054323230769230735,614689.9,0,0,"0",0.16454073818830678,-0.2668418823529413,0,1.014865871833085,36765.83,0.7106192050373868,0,1]
["CAP/L",13058,"IS/IT Project for NASA","Completed","CFA","Liu Min","Tao Yang",41407,41821,41995,0,"N","ZNIC.013058","NZNIC013058K",null,13058,10180000,2092000,10453379,10398219.24,55160,-1839306.56,0,10180000,"0",0,12272000,10453379.24,-0.1481926955671447,10398219.24,55160,0,"0",{"$error":"#DIV/0!"},{"$error":"#DIV/0!"},0,{"$error":"#DIV/0!"},0,{"$error":"#DIV/0!"},0,0]
["CCP/A",13054,"Add 2000m3 EDA Tank in RTTF","Completed","CTE/P","Jiang Hao/Liu Xiaoli","Xu Yefeng/Zong Baorong",41697,42129,0,0,"T_2015","ZNIC.013054","NZNIC013054K",null,13054,15880000,0,17551322,19104689.11,88866.57,-517624.15,-720912.5,15880000,"0",24293.10000000056,15880000,19242555.68,0.21174783879093198,19104689.11,88866.57,49000,"0",0.3780810393550388,-0.30242961744195335,0,2.667603576030928,0,4.096703178694158,0,1]
["CBP/P",13016,"MarkV Upgrade of Gas Turbines Control System, Power Plant","On Going","CTA/U","Lei Yufa","He Zhengyu",41306,0,0,0,"N","ZNIC.013016","NZNIC013016K",null,13016,18000000,0,18075872,9270482.94,871.8,460845,-267896.5,18000000,2140638.619999999,6127161.640000001,18000000,11411993.36,-0.3660003688888889,9270482.94,871.8,0,2140638.619999999,-0.38982070709584715,0.04953440458467697,460845,0.2910076923076923,0,1.8929883333333333,0,0]
["CBP/C",12137,"Replace Radiant Section Tubes for 7 Liquid Furnaces","Completed","CTE/P","Zhou Yanduo","Tong Shaojian",41381,42340,0,0,"T","ZNIC.012137","NZNIC012137K",null,12137,58500000,0,63756970,44906196.54,0,21414.339999999967,1324100.3599999999,58500000,9980626.849999998,2051891.9100000039,58500000,55102593.39,-0.058075326666666656,44906196.54,0,215770,9980626.849999998,0.014511765137251892,-0.16678516885769457,21414.339999999967,0.934286643651707,1324100.3599999999,0.4453449115090586,0,27]
["CBP/B",12119,"Add a Filter to Remove Metal Ions from IBOL","Completed","CTE/P","Sun Aihong","Ling Taizhong",41359,41781,42216,0,"N","ZNIC.012119","NZNIC012119K",null,12119,1570000,0,1571500,1225101.06,0,-172047.53000000003,-78710.57,{"$error":"#N/A"},"0",{"$error":"#N/A"},1570000,1226601.06,-0.21872543949044582,1225101.06,0,1500,"0",{"$error":"#N/A"},-0.23812805503168324,0,1.7784956108597287,0,1.5428315172413793,0,7]
["CBP/B",12071,"Add Raffinate I Washer Column System in BD Plant","Completed","CTE/P","Cao Lin","Wang Yuncai",41526,41939,0,0,"T_2015","ZNIC.012071","NZNIC012071K",null,12071,8622000,0,8824040,7814981.88,198113.21,-1043844.1499999999,-535306.1200000001,8622000,"0",-75000.20999999926,8622000,8013095.09,-0.07062223498028301,7814981.88,198113.21,0,"0",0.09062958023208761,-0.1071117703370587,0,2.5158933343014813,0,1.599497292605762,2,10]
["CTS/P",12044,"Cooling Water Expansion from PP to Syngas","Completed","CTE/P","Sun Duoxun","Wu Zefei",41764,42121,0,0,"T_2015","ZNIC.012044","NZNIC012044K",null,12044,3830000,0,3834800,1998299.17,0,-61072.5,-40305.81,3830000,"0",1054974.6800000002,3830000,1998299.17,-0.47825086945169715,1998299.17,0,0,"0",-0.4093016482071544,-0.1963874833345581,0,1.287670748940179,0,1.2890859601936524,0,1]
["CBP/M",11229,"Revamp Dosing System of Cooling System of EB/SM","Completed","CTE/P","Zhu Jianxin","Ling Taizhong",41709,42133,0,0,"H","ZNIC.011229","NZNIC011229K",null,11229,1099000,0,1101000,996916.14,0,-191656.97999999998,-142193.84999999998,1099000,"0",224642.99,1099000,998916.14,-0.09106811646951773,996916.14,0,2000,"0",-0.012822580406646768,-0.3830494619313376,0,1.8519981329184263,0,1.807919602272727,2,6]

{"sheet":"Sheet5","index":3,"n_rows":142,"n_cols":14,"rows_kept":142,"hidden":true,"merged":[[0,0,0,13]]}
["Cost Report for MOC"]
["BU. ","Job No","Job Type","Job Title","Account","PM","MC","Budget","Planned","Actual","Cost to Com","Estiamted Final Cost","COST_COMPLE%","Remarks"]
[{"$f":"VLOOKUP(B3,[1]Eproject!$A:$B,2,FALSE)","v":"CBP/P"},15313,{"$f":"VLOOKUP(B3,[1]Eproject!$A:$C,3,FALSE)","v":"MOC"},{"$f":"VLOOKUP(B3,[1]Eproject!$A:$E,5,FALSE)","v":"Protection Relay of U4PM6101A Replacement for Updating"},{"$f":"VLOOKUP(B3,[1]Eproject!$A:$U,21,FALSE)","v":"973434426"},{"$f":"VLOOKUP(B3,[1]Eproject!$A:$J,10,FALSE)","v":"Ge Yong"},{"$f":"VLOOKUP(B3,[1]Eproject!$A:$P,16,FALSE)","v":"00:00:00"},{"$f":"VLOOKUP(E3,'[1]actual cost'!$F:$G,2,FALSE)","v":{"$error":"#N/A"}},{"$f":"VLOOKUP(E3,'[1]actual cost'!$F:$H,3,FALSE)","v":{"$error":"#N/A"}},{"$f":"VLOOKUP(E3,'[1]actual cost'!$F:$I,4,FALSE)","v":{"$error":"#N/A"}},{"$f":"IF(J3>I3,0,I3-J3)","v":{"$error":"#N/A"}},{"$f":"J3+K3","v":{"$error":"#N/A"}},{"$f":"J3/H3","v":{"$error":"#N/A"}}]
[{"$f":"VLOOKUP(B4,[1]Eproject!$A:$B,2,FALSE)","v":"COA/A"},15309,{"$f":"VLOOKUP(B4,[1]Eproject!$A:$C,3,FALSE)","v":"MOC"},{"$f":"VLOOKUP(B4,[1]Eproject!$A:$E,5,FALSE)","v":"Add Filter on Inlet of F430"},{"$f":"VLOOKUP(B4,[1]Eproject!$A:$U,21,FALSE)","v":"973506548"},{"$f":"VLOOKUP(B4,[1]Eproject!$A:$J,10,FALSE)","v":"Meng Yousheng"},{"$f":"VLOOKUP(B4,[1]Eproject!$A:$P,16,FALSE)","v":"2015-12-10"},{"$f":"VLOOKUP(E4,'[1]actual cost'!$F:$G,2,FALSE)","v":{"$error":"#N/A"}},{"$f":"VLOOKUP(E4,'[1]actual cost'!$F:$H,3,FALSE)","v":{"$error":"#N/A"}},{"$f":"VLOOKUP(E4,'[1]actual cost'!$F:$I,4,FALSE)","v":{"$error":"#N/A"}},{"$f":"IF(J4>I4,0,I4-J4)","v":{"$error":"#N/A"}},{"$f":"J4+K4","v":{"$error":"#N/A"}},{"$f":"J4/H4","v":{"$error":"#N/A"}}]
[{"$f":"VLOOKUP(B5,[1]Eproject!$A:$B,2,FALSE)","v":"CEP/E"},15307,{"$f":"VLOOKUP(B5,[1]Eproject!$A:$C,3,FALSE)","v":"MOC"},{"$f":"VLOOKUP(B5,[1]Eproject!$A:$E,5,FALSE)","v":"Add Tie-in for Chiller U3777"},{"$f":"VLOOKUP(B5,[1]Eproject!$A:$U,21,FALSE)","v":"973507320"},{"$f":"VLOOKUP(B5,[1]Eproject!$A:$J,10,FALSE)","v":"Wang Zhigao"},{"$f":"VLOOKUP(B5,[1]Eproject!$A:$P,16,FALSE)","v":"00:00:00"},{"$f":"VLOOKUP(E5,'[1]actual cost'!$F:$G,2,FALSE)","v":{"v":33800,"d":"33,800 "}},{"$f":"VLOOKUP(E5,'[1]actual cost'!$F:$H,3,FALSE)","v":{"v":23800,"d":"23,800 "}},{"$f":"VLOOKUP(E5,'[1]actual cost'!$F:$I,4,FALSE)","v":{"v":17020,"d":"17,020 "}},{"v":6780,"d":"6,780"},{"v":23800,"d":"23,800 "},{"v":0.5035502958579882,"d":"50.36%"}]
[{"$f":"VLOOKUP(B6,[1]Eproject!$A:$B,2,FALSE)","v":"CEP/E"},15304,{"$f":"VLOOKUP(B6,[1]Eproject!$A:$C,3,FALSE)","v":"MOC"},{"$f":"VLOOKUP(B6,[1]Eproject!$A:$E,5,FALSE)","v":"Add a Filter at Outlet of P5311"},{"$f":"VLOOKUP(B6,[1]Eproject!$A:$U,21,FALSE)","v":"973507099"},{"$f":"VLOOKUP(B6,[1]Eproject!$A:$J,10,FALSE)","v":"Li Jun"},{"$f":"VLOOKUP(B6,[1]Eproject!$A:$P,16,FALSE)","v":"00:00:00"},{"$f":"VLOOKUP(E6,'[1]actual cost'!$F:$G,2,FALSE)","v":{"v":23800,"d":"23,800 "}},{"$f":"VLOOKUP(E6,'[1]actual cost'!$F:$H,3,FALSE)","v":{"v":23800,"d":"23,800 "}},{"$f":"VLOOKUP(E6,'[1]actual cost'!$F:$I,4,FALSE)","v":{"v":7200,"d":"7,200 "}},{"v":16600,"d":"16,600"},{"v":23800,"d":"23,800 "},{"v":0.3025210084033613,"d":"30.25%"}]
[{"$f":"VLOOKUP(B7,[1]Eproject!$A:$B,2,FALSE)","v":"CBP/B"},15303,{"$f":"VLOOKUP(B7,[1]Eproject!$A:$C,3,FALSE)","v":"MOC"},{"$f":"VLOOKUP(B7,[1]Eproject!$A:$E,5,FALSE)","v":"Connect the Original and New Fuel Oil Line in BD"},{"$f":"VLOOKUP(B7,[1]Eproject!$A:$U,21,FALSE)","v":"973519560"},{"$f":"VLOOKUP(B7,[1]Eproject!$A:$J,10,FALSE)","v":"Wang Can"},{"$f":"VLOOKUP(B7,[1]Eproject!$A:$P,16,FALSE)","v":"00:00:00"},{"$f":"VLOOKUP(E7,'[1]actual cost'!$F:$G,2,FALSE)","v":{"$error":"#N/A"}},{"$f":"VLOOKUP(E7,'[1]actual cost'!$F:$H,3,FALSE)","v":{"$error":"#N/A"}},{"$f":"VLOOKUP(E7,'[1]actual cost'!$F:$I,4,FALSE)","v":{"$error":"#N/A"}},{"$error":"#N/A"},{"$error":"#N/A"},{"$error":"#N/A"}]
[{"$f":"VLOOKUP(B8,[1]Eproject!$A:$B,2,FALSE)","v":"CEP/E"},15302,{"$f":"VLOOKUP(B8,[1]Eproject!$A:$C,3,FALSE)","v":"MOC"},{"$f":"VLOOKUP(B8,[1]Eproject!$A:$E,5,FALSE)","v":"Add a Spring Hanger to T13017-1"},{"$f":"VLOOKUP(B8,[1]Eproject!$A:$U,21,FALSE)","v":"973378059"},{"$f":"VLOOKUP(B8,[1]Eproject!$A:$J,10,FALSE)","v":"Gu Jingfeng"},{"$f":"VLOOKUP(B8,[1]Eproject!$A:$P,16,FALSE)","v":"00:00:00"},{"$f":"VLOOKUP(E8,'[1]actual cost'!$F:$G,2,FALSE)","v":{"$error":"#N/A"}},{"$f":"VLOOKUP(E8,'[1]actual cost'!$F:$H,3,FALSE)","v":{"$error":"#N/A"}},{"$f":"VLOOKUP(E8,'[1]actual cost'!$F:$I,4,FALSE)","v":{"$error":"#N/A"}},{"$error":"#N/A"},{"$error":"#N/A"},{"$error":"#N/A"}]
[{"$f":"VLOOKUP(B9,[1]Eproject!$A:$B,2,FALSE)","v":"CBP/B"},15299,{"$f":"VLOOKUP(B9,[1]Eproject!$A:$C,3,FALSE)","v":"MOC"},{"$f":"VLOOKUP(B9,[1]Eproject!$A:$E,5,FALSE)","v":"Redesign& Reinstall the Fuel Oil Line from BD to EU Piperack"},{"$f":"VLOOKUP(B9,[1]Eproject!$A:$U,21,FALSE)","v":"973529386"},{"$f":"VLOOKUP(B9,[1]Eproject!$A:$J,10,FALSE)","v":"Wang Can"},{"$f":"VLOOKUP(B9,[1]Eproject!$A:$P,16,FALSE)","v":"00:00:00"},{"$f":"VLOOKUP(E9,'[1]actual cost'!$F:$G,2,FALSE)","v":{"$error":"#N/A"}},{"$f":"VLOOKUP(E9,'[1]actual cost'!$F:$H,3,FALSE)","v":{"$error":"#N/A"}},{"$f":"VLOOKUP(E9,'[1]actual cost'!$F:$I,4,FALSE)","v":{"$error":"#N/A"}},{"$error":"#N/A"},{"$error":"#N/A"},{"$error":"#N/A"}]
[{"$f":"VLOOKUP(B10,[1]Eproject!$A:$B,2,FALSE)","v":"CBP/S"},15294,{"$f":"VLOOKUP(B10,[1]Eproject!$A:$C,3,FALSE)","v":"MOC"},{"$f":"VLOOKUP(B10,[1]Eproject!$A:$E,5,FALSE)","v":"Adding H2 Detectors for Coldbox's Leakage"},{"$f":"VLOOKUP(B10,[1]Eproject!$A:$U,21,FALSE)","v":"973495739"},{"$f":"VLOOKUP(B10,[1]Eproject!$A:$J,10,FALSE)","v":"Gong Feibao"},{"$f":"VLOOKUP(B10,[1]Eproject!$A:$P,16,FALSE)","v":"00:00:00"},{"$f":"VLOOKUP(E10,'[1]actual cost'!$F:$G,2,FALSE)","v":{"v":121000,"d":"121,000 "}},{"$f":"VLOOKUP(E10,'[1]actual cost'!$F:$H,3,FALSE)","v":{"v":105859.22,"d":"105,859 "}},{"$f":"VLOOKUP(E10,'[1]actual cost'!$F:$I,4,FALSE)","v":{"v":65708.16,"d":"65,708 "}},{"v":40151.06,"d":"40,151"},{"v":105859.22,"d":"105,859 "},{"v":0.5430426446280991,"d":"54.30%"}]
[{"$f":"VLOOKUP(B11,[1]Eproject!$A:$B,2,FALSE)","v":"CEP/P"},15282,{"$f":"VLOOKUP(B11,[1]Eproject!$A:$C,3,FALSE)","v":"MOC"},{"$f":"VLOOKUP(B11,[1]Eproject!$A:$E,5,FALSE)","v":"Add Liquid Waste tank"},{"$f":"VLOOKUP(B11,[1]Eproject!$A:$U,21,FALSE)","v":"973471450"},{"$f":"VLOOKUP(B11,[1]Eproject!$A:$J,10,FALSE)","v":"Gu Jingfeng"},{"$f":"VLOOKUP(B11,[1]Eproject!$A:$P,16,FALSE)","v":"00:00:00"},{"$f":"VLOOKUP(E11,'[1]actual cost'!$F:$G,2,FALSE)","v":{"v":39050,"d":"39,050 "}},{"$f":"VLOOKUP(E11,'[1]actual cost'!$F:$H,3,FALSE)","v":{"v":0,"d":"0 "}},{"$f":"VLOOKUP(E11,'[1]actual cost'!$F:$I,4,FALSE)","v":{"v":6600,"d":"6,600 "}},0,{"v":6600,"d":"6,600 "},{"v":0.16901408450704225,"d":"16.90%"}]
[{"$f":"VLOOKUP(B12,[1]Eproject!$A:$B,2,FALSE)","v":"COA/A"},15280,{"$f":"VLOOKUP(B12,[1]Eproject!$A:$C,3,FALSE)","v":"MOC"},{"$f":"VLOOKUP(B12,[1]Eproject!$A:$E,5,FALSE)","v":"Add Local Pressure Gauge on Inlet P430"},{"$f":"VLOOKUP(B12,[1]Eproject!$A:$U,21,FALSE)","v":"973470849"},{"$f":"VLOOKUP(B12,[1]Eproject!$A:$J,10,FALSE)","v":"Meng Yousheng"},{"$f":"VLOOKUP(B12,[1]Eproject!$A:$P,16,FALSE)","v":"00:00:00"},{"$f":"VLOOKUP(E12,'[1]actual cost'!$F:$G,2,FALSE)","v":{"v":15000,"d":"15,000 "}},{"$f":"VLOOKUP(E12,'[1]actual cost'!$F:$H,3,FALSE)","v":{"v":9400,"d":"9,400 "}},{"$f":"VLOOKUP(E12,'[1]actual cost'!$F:$I,4,FALSE)","v":{"v":2750,"d":"2,750 "}},{"v":6650,"d":"6,650"},{"v":9400,"d":"9,400 "},{"v":0.18333333333333332,"d":"18.33%"}]
[{"$f":"VLOOKUP(B13,[1]Eproject!$A:$B,2,FALSE)","v":"CBP/C"},15276,{"$f":"VLOOKUP(B13,[1]Eproject!$A:$C,3,FALSE)","v":"MOC"},{"$f":"VLOOKUP(B13,[1]Eproject!$A:$E,5,FALSE)","v":"Modify the Gas Sampler Type to Closed Loop Sampler at  Prolysis Gasoline Unit(PGU)"},{"$f":"VLOOKUP(B13,[1]Eproject!$A:$U,21,FALSE)","v":"973482590"},{"$f":"VLOOKUP(B13,[1]Eproject!$A:$J,10,FALSE)","v":"Sun Aihong"},{"$f":"VLOOKUP(B13,[1]Eproject!$A:$P,16,FALSE)","v":"00:00:00"},{"$f":"VLOOKUP(E13,'[1]actual cost'!$F:$G,2,FALSE)","v":{"v":20000,"d":"20,000 "}},{"$f":"VLOOKUP(E13,'[1]actual cost'!$F:$H,3,FALSE)","v":{"v":17520,"d":"17,520 "}},{"$f":"VLOOKUP(E13,'[1]actual cost'!$F:$I,4,FALSE)","v":{"v":4400,"d":"4,400 "}},{"v":13120,"d":"13,120"},{"v":17520,"d":"17,520 "},{"v":0.22,"d":"22.00%"}]
[{"$f":"VLOOKUP(B14,[1]Eproject!$A:$B,2,FALSE)","v":"CBP/C"},15275,{"$f":"VLOOKUP(B14,[1]Eproject!$A:$C,3,FALSE)","v":"MOC"},{"$f":"VLOOKUP(B14,[1]Eproject!$A:$E,5,FALSE)","v":"Modify the EBO Product Sampler Type to Closed Loop Sampler at Quench Section"},{"$f":"VLOOKUP(B14,[1]Eproject!$A:$U,21,FALSE)","v":"973482589"},{"$f":"VLOOKUP(B14,[1]Eproject!$A:$J,10,FALSE)","v":"Sun Aihong"},{"$f":"VLOOKUP(B14,[1]Eproject!$A:$P,16,FALSE)","v":"00:00:00"},{"$f":"VLOOKUP(E14,'[1]actual cost'!$F:$G,2,FALSE)","v":{"v":20000,"d":"20,000 "}},{"$f":"VLOOKUP(E14,'[1]actual cost'!$F:$H,3,FALSE)","v":{"v":17520,"d":"17,520 "}},{"$f":"VLOOKUP(E14,'[1]actual cost'!$F:$I,4,FALSE)","v":{"v":0,"d":"0 "}},{"v":17520,"d":"17,520"},{"v":17520,"d":"17,520 "},{"v":0,"d":"0.00%"}]
[{"$f":"VLOOKUP(B15,[1]Eproject!$A:$B,2,FALSE)","v":"CTE"},15271,{"$f":"VLOOKUP(B15,[1]Eproject!$A:$C,3,FALSE)","v":"MOC"},{"$f":"VLOOKUP(B15,[1]Eproject!$A:$E,5,FALSE)","v":"Modification of Road Lamp at North Gate on the Yangba raod."},{"$f":"VLOOKUP(B15,[1]Eproject!$A:$U,21,FALSE)","v":"973487007"},{"$f":"VLOOKUP(B15,[1]Eproject!$A:$J,10,FALSE)","v":"Bian Jiacai"},{"$f":"VLOOKUP(B15,[1]Eproject!$A:$P,16,FALSE)","v":"00:00:00"},{"$f":"VLOOKUP(E15,'[1]actual cost'!$F:$G,2,FALSE)","v":{"v":119789,"d":"119,789 "}},{"$f":"VLOOKUP(E15,'[1]actual cost'!$F:$H,3,FALSE)","v":{"v":75265.27,"d":"75,265 "}},{"$f":"VLOOKUP(E15,'[1]actual cost'!$F:$I,4,FALSE)","v":{"v":5500,"d":"5,500 "}},{"v":69765.27,"d":"69,765"},{"v":75265.27,"d":"75,265 "},{"v":0.04591406556528563,"d":"4.59%"}]
[{"$f":"VLOOKUP(B16,[1]Eproject!$A:$B,2,FALSE)","v":"CEP/E"},15269,{"$f":"VLOOKUP(B16,[1]Eproject!$A:$C,3,FALSE)","v":"MOC"},{"$f":"VLOOKUP(B16,[1]Eproject!$A:$E,5,FALSE)","v":"EO Analyzer House Air Conditioning System Modification"},{"$f":"VLOOKUP(B16,[1]Eproject!$A:$U,21,FALSE)","v":"973454483"},{"$f":"VLOOKUP(B16,[1]Eproject!$A:$J,10,FALSE)","v":"Wang Wei"},{"$f":"VLOOKUP(B16,[1]Eproject!$A:$P,16,FALSE)","v":"00:00:00"},{"$f":"VLOOKUP(E16,'[1]actual cost'!$F:$G,2,FALSE)","v":{"v":680000,"d":"680,000 "}},{"$f":"VLOOKUP(E16,'[1]actual cost'!$F:$H,3,FALSE)","v":{"v":339750,"d":"339,750 "}},{"$f":"VLOOKUP(E16,'[1]actual cost'!$F:$I,4,FALSE)","v":{"v":4400,"d":"4,400 "}},{"v":335350,"d":"335,350"},{"v":339750,"d":"339,750 "},{"v":0.006470588235294118,"d":"0.65%"}]
[{"$f":"VLOOKUP(B17,[1]Eproject!$A:$B,2,FALSE)","v":"COO/A"},15261,{"$f":"VLOOKUP(B17,[1]Eproject!$A:$C,3,FALSE)","v":"MOC"},{"$f":"VLOOKUP(B17,[1]Eproject!$A:$E,5,FALSE)","v":"Add Drain Valves"},{"$f":"VLOOKUP(B17,[1]Eproject!$A:$U,21,FALSE)","v":"973437650"},{"$f":"VLOOKUP(B17,[1]Eproject!$A:$J,10,FALSE)","v":"Chen Yuxin"},{"$f":"VLOOKUP(B17,[1]Eproject!$A:$P,16,FALSE)","v":"2015-10-23"},{"$f":"VLOOKUP(E17,'[1]actual cost'!$F:$G,2,FALSE)","v":{"v":0,"d":"0 "}},{"$f":"VLOOKUP(E17,'[1]actual cost'!$F:$H,3,FALSE)","v":{"v":0,"d":"0 "}},{"$f":"VLOOKUP(E17,'[1]actual cost'!$F:$I,4,FALSE)","v":{"v":0,"d":"0 "}},0,{"v":0,"d":"0 "},{"$error":"#DIV/0!"}]
[{"$f":"VLOOKUP(B18,[1]Eproject!$A:$B,2,FALSE)","v":"COO/A"},15249,{"$f":"VLOOKUP(B18,[1]Eproject!$A:$C,3,FALSE)","v":"MOC"},{"$f":"VLOOKUP(B18,[1]Eproject!$A:$E,5,FALSE)","v":"Add a Set of Drain Valves and Sightglass on K4800A/B and K4992A/B with EHT"},{"$f":"VLOOKUP(B18,[1]Eproject!$A:$U,21,FALSE)","v":"973458234"},{"$f":"VLOOKUP(B18,[1]Eproject!$A:$J,10,FALSE)","v":"Li Shouqing"},{"$f":"VLOOKUP(B18,[1]Eproject!$A:$P,16,FALSE)","v":"00:00:00"},{"$f":"VLOOKUP(E18,'[1]actual cost'!$F:$G,2,FALSE)","v":{"v":150720,"d":"150,720 "}},{"$f":"VLOOKUP(E18,'[1]actual cost'!$F:$H,3,FALSE)","v":{"v":122883,"d":"122,883 "}},{"$f":"VLOOKUP(E18,'[1]actual cost'!$F:$I,4,FALSE)","v":{"v":25300,"d":"25,300 "}},{"v":97583,"d":"97,583"},{"v":122883,"d":"122,883 "},{"v":0.16786093418259024,"d":"16.79%"}]
[{"$f":"VLOOKUP(B19,[1]Eproject!$A:$B,2,FALSE)","v":"COO/C"},15244,{"$f":"VLOOKUP(B19,[1]Eproject!$A:$C,3,FALSE)","v":"MOC"},{"$f":"VLOOKUP(B19,[1]Eproject!$A:$E,5,FALSE)","v":"Modify the Cofferdam of Waste Oil IBCs"},{"$f":"VLOOKUP(B19,[1]Eproject!$A:$U,21,FALSE)","v":"973386824"},{"$f":"VLOOKUP(B19,[1]Eproject!$A:$J,10,FALSE)","v":"Xia Qun"},{"$f":"VLOOKUP(B19,[1]Eproject!$A:$P,16,FALSE)","v":"2015-10-20"},{"$f":"VLOOKUP(E19,'[1]actual cost'!$F:$G,2,FALSE)","v":{"v":27825,"d":"27,825 "}},{"$f":"VLOOKUP(E19,'[1]actual cost'!$F:$H,3,FALSE)","v":{"v":27705,"d":"27,705 "}},{"$f":"VLOOKUP(E19,'[1]actual cost'!$F:$I,4,FALSE)","v":{"v":14313.9,"d":"14,314 "}},{"v":13391.1,"d":"13,391"},{"v":27705,"d":"27,705 "},{"v":0.5144258760107817,"d":"51.44%"}]
[{"$f":"VLOOKUP(B20,[1]Eproject!$A:$B,2,FALSE)","v":"CBP/P"},15238,{"$f":"VLOOKUP(B20,[1]Eproject!$A:$C,3,FALSE)","v":"MOC"},{"$f":"VLOOKUP(B20,[1]Eproject!$A:$E,5,FALSE)","v":"Add Grid and Lock for U456-TR-001/002/003/004/005/006"},{"$f":"VLOOKUP(B20,[1]Eproject!$A:$U,21,FALSE)","v":"973344599"},{"$f":"VLOOKUP(B20,[1]Eproject!$A:$J,10,FALSE)","v":"Wang Shicheng"},{"$f":"VLOOKUP(B20,[1]Eproject!$A:$P,16,FALSE)","v":"00:00:00"},{"$f":"VLOOKUP(E20,'[1]actual cost'!$F:$G,2,FALSE)","v":{"v":122500,"d":"122,500 "}},{"$f":"VLOOKUP(E20,'[1]actual cost'!$F:$H,3,FALSE)","v":{"v":139962.5,"d":"139,963 "}},{"$f":"VLOOKUP(E20,'[1]actual cost'!$F:$I,4,FALSE)","v":{"v":2475,"d":"2,475 "}},{"v":137487.5,"d":"137,488"},{"v":139962.5,"d":"139,963 "},{"v":0.02020408163265306,"d":"2.02%"}]
[{"$f":"VLOOKUP(B21,[1]Eproject!$A:$B,2,FALSE)","v":"CBP/S"},15235,{"$f":"VLOOKUP(B21,[1]Eproject!$A:$C,3,FALSE)","v":"MOC"},{"$f":"VLOOKUP(B21,[1]Eproject!$A:$E,5,FALSE)","v":"Add Temporary Piping to V1202 from P1201 Outlet"},{"$f":"VLOOKUP(B21,[1]Eproject!$A:$U,21,FALSE)","v":"973376659"},{"$f":"VLOOKUP(B21,[1]Eproject!$A:$J,10,FALSE)","v":"Wang Can"},{"$f":"VLOOKUP(B21,[1]Eproject!$A:$P,16,FALSE)","v":"2015-10-14"},{"$f":"VLOOKUP(E21,'[1]actual cost'!$F:$G,2,FALSE)","v":{"v":88170,"d":"88,170 "}},{"$f":"VLOOKUP(E21,'[1]actual cost'!$F:$H,3,FALSE)","v":{"v":90969.56,"d":"90,970 "}},{"$f":"VLOOKUP(E21,'[1]actual cost'!$F:$I,4,FALSE)","v":{"v":73325.48,"d":"73,325 "}},{"v":17644.08,"d":"17,644"},{"v":90969.56,"d":"90,970 "},{"v":0.8316375184303051,"d":"83.16%"}]
[{"$f":"VLOOKUP(B22,[1]Eproject!$A:$B,2,FALSE)","v":"COO/C"},15234,{"$f":"VLOOKUP(B22,[1]Eproject!$A:$C,3,FALSE)","v":"MOC"},{"$f":"VLOOKUP(B22,[1]Eproject!$A:$E,5,FALSE)","v":"Add a Cofferdam around P3812"},{"$f":"VLOOKUP(B22,[1]Eproject!$A:$U,21,FALSE)","v":"973378581"},{"$f":"VLOOKUP(B22,[1]Eproject!$A:$J,10,FALSE)","v":"Xia Qun"},{"$f":"VLOOKUP(B22,[1]Eproject!$A:$P,16,FALSE)","v":"2015-11-27"},{"$f":"VLOOKUP(E22,'[1]actual cost'!$F:$G,2,FALSE)","v":{"v":83350,"d":"83,350 "}},{"$f":"VLOOKUP(E22,'[1]actual cost'!$F:$H,3,FALSE)","v":{"v":79540,"d":"79,540 "}},{"$f":"VLOOKUP(E22,'[1]actual cost'!$F:$I,4,FALSE)","v":{"v":23550,"d":"23,550 "}},{"v":55990,"d":"55,990"},{"v":79540,"d":"79,540 "},{"v":0.28254349130173967,"d":"28.25%"}]
[{"$f":"VLOOKUP(B23,[1]Eproject!$A:$B,2,FALSE)","v":"COO/C"},15232,{"$f":"VLOOKUP(B23,[1]Eproject!$A:$C,3,FALSE)","v":"MOC"},{"$f":"VLOOKUP(B23,[1]Eproject!$A:$E,5,FALSE)","v":"Relocate the Hose Reel Box Beside P2200"},{"$f":"VLOOKUP(B23,[1]Eproject!$A:$U,21,FALSE)","v":"973379392"},{"$f":"VLOOKUP(B23,[1]Eproject!$A:$J,10,FALSE)","v":"Zhang Fanwen"},{"$f":"VLOOKUP(B23,[1]Eproject!$A:$P,16,FALSE)","v":"2015-09-30"},{"$f":"VLOOKUP(E23,'[1]actual cost'!$F:$G,2,FALSE)","v":{"v":47650,"d":"47,650 "}},{"$f":"VLOOKUP(E23,'[1]actual cost'!$F:$H,3,FALSE)","v":{"v":41214.87,"d":"41,215 "}},{"$f":"VLOOKUP(E23,'[1]actual cost'!$F:$I,4,FALSE)","v":{"v":26831.11,"d":"26,831 "}},{"v":14383.760000000002,"d":"14,384"},{"v":41214.87,"d":"41,215 "},{"v":0.5630873032528856,"d":"56.31%"}]
[{"$f":"VLOOKUP(B24,[1]Eproject!$A:$B,2,FALSE)","v":"COO/C"},15227,{"$f":"VLOOKUP(B24,[1]Eproject!$A:$C,3,FALSE)","v":"MOC"},{"$f":"VLOOKUP(B24,[1]Eproject!$A:$E,5,FALSE)","v":"Modification of PA HB/LB Loading System According Assessment"},{"$f":"VLOOKUP(B24,[1]Eproject!$A:$U,21,FALSE)","v":"973360623"},{"$f":"VLOOKUP(B24,[1]Eproject!$A:$J,10,FALSE)","v":"Xia Qun"},{"$f":"VLOOKUP(B24,[1]Eproject!$A:$P,16,FALSE)","v":"2015-10-20"},{"$f":"VLOOKUP(E24,'[1]actual cost'!$F:$G,2,FALSE)","v":{"v":180000,"d":"180,000 "}},{"$f":"VLOOKUP(E24,'[1]actual cost'!$F:$H,3,FALSE)","v":{"v":129784,"d":"129,784 "}},{"$f":"VLOOKUP(E24,'[1]actual cost'!$F:$I,4,FALSE)","v":{"v":86450.97,"d":"86,451 "}},{"v":43333.03,"d":"43,333"},{"v":129784,"d":"129,784 "},{"v":0.48028316666666665,"d":"48.03%"}]
[{"$f":"VLOOKUP(B25,[1]Eproject!$A:$B,2,FALSE)","v":"CBP/M"},15224,{"$f":"VLOOKUP(B25,[1]Eproject!$A:$C,3,FALSE)","v":"MOC"},{"$f":"VLOOKUP(B25,[1]Eproject!$A:$E,5,FALSE)","v":"Add a Pavement between EB/SM and BD/IB"},{"$f":"VLOOKUP(B25,[1]Eproject!$A:$U,21,FALSE)","v":"973319084"},{"$f":"VLOOKUP(B25,[1]Eproject!$A:$J,10,FALSE)","v":"Yan Jun"},{"$f":"VLOOKUP(B25,[1]Eproject!$A:$P,16,FALSE)","v":"2015-10-21"},{"$f":"VLOOKUP(E25,'[1]actual cost'!$F:$G,2,FALSE)","v":{"v":47000,"d":"47,000 "}},{"$f":"VLOOKUP(E25,'[1]actual cost'!$F:$H,3,FALSE)","v":{"v":46608,"d":"46,608 "}},{"$f":"VLOOKUP(E25,'[1]actual cost'!$F:$I,4,FALSE)","v":{"v":31091.58,"d":"31,092 "}},{"v":15516.419999999998,"d":"15,516"},{"v":46608,"d":"46,608 "},{"v":0.6615229787234043,"d":"66.15%"}]
[{"$f":"VLOOKUP(B26,[1]Eproject!$A:$B,2,FALSE)","v":"CBP/P"},15222,{"$f":"VLOOKUP(B26,[1]Eproject!$A:$C,3,FALSE)","v":"MOC"},{"$f":"VLOOKUP(B26,[1]Eproject!$A:$E,5,FALSE)","v":"Anti-vibration for Inlet and Discharge Line of P6402C"},{"$f":"VLOOKUP(B26,[1]Eproject!$A:$U,21,FALSE)","v":"973488820"},{"$f":"VLOOKUP(B26,[1]Eproject!$A:$J,10,FALSE)","v":"Wang Can"},{"$f":"VLOOKUP(B26,[1]Eproject!$A:$P,16,FALSE)","v":"00:00:00"},{"$f":"VLOOKUP(E26,'[1]actual cost'!$F:$G,2,FALSE)","v":{"v":193000,"d":"193,000 "}},{"$f":"VLOOKUP(E26,'[1]actual cost'!$F:$H,3,FALSE)","v":{"v":140525,"d":"140,525 "}},{"$f":"VLOOKUP(E26,'[1]actual cost'!$F:$I,4,FALSE)","v":{"v":33530,"d":"33,530 "}},{"v":106995,"d":"106,995"},{"v":140525,"d":"140,525 "},{"v":0.17373056994818653,"d":"17.37%"}]
[{"$f":"VLOOKUP(B27,[1]Eproject!$A:$B,2,FALSE)","v":"CBP/U"},15221,{"$f":"VLOOKUP(B27,[1]Eproject!$A:$C,3,FALSE)","v":"MOC"},{"$f":"VLOOKUP(B27,[1]Eproject!$A:$E,5,FALSE)","v":"CBPU Modlify HPFW System into YBS"},{"$f":"VLOOKUP(B27,[1]Eproject!$A:$U,21,FALSE)","v":"973517510"},{"$f":"VLOOKUP(B27,[1]Eproject!$A:$J,10,FALSE)","v":"Zhang Fanwen"},{"$f":"VLOOKUP(B27,[1]Eproject!$A:$P,16,FALSE)","v":"00:00:00"},{"$f":"VLOOKUP(E27,'[1]actual cost'!$F:$G,2,FALSE)","v":{"$error":"#N/A"}},{"$f":"VLOOKUP(E27,'[1]actual cost'!$F:$H,3,FALSE)","v":{"$error":"#N/A"}},{"$f":"VLOOKUP(E27,'[1]actual cost'!$F:$I,4,FALSE)","v":{"$error":"#N/A"}},{"$error":"#N/A"},{"$error":"#N/A"},{"$error":"#N/A"}]
[{"$f":"VLOOKUP(B28,[1]Eproject!$A:$B,2,FALSE)","v":"COO/C"},15212,{"$f":"VLOOKUP(B28,[1]Eproject!$A:$C,3,FALSE)","v":"MOC"},{"$f":"VLOOKUP(B28,[1]Eproject!$A:$E,5,FALSE)","v":"Add a Sample Point at C2619 Off Gas Pipe"},{"$f":"VLOOKUP(B28,[1]Eproject!$A:$U,21,FALSE)","v":"973384528"},{"$f":"VLOOKUP(B28,[1]Eproject!$A:$J,10,FALSE)","v":"Li Shouqing"},{"$f":"VLOOKUP(B28,[1]Eproject!$A:$P,16,FALSE)","v":"00:00:00"},{"$f":"VLOOKUP(E28,'[1]actual cost'!$F:$G,2,FALSE)","v":{"v":198990,"d":"198,990 "}},{"$f":"VLOOKUP(E28,'[1]actual cost'!$F:$H,3,FALSE)","v":{"v":138990,"d":"138,990 "}},{"$f":"VLOOKUP(E28,'[1]actual cost'!$F:$I,4,FALSE)","v":{"v":0,"d":"0 "}},{"v":138990,"d":"138,990"},{"v":138990,"d":"138,990 "},{"v":0,"d":"0.00%"}]
[{"$f":"VLOOKUP(B29,[1]Eproject!$A:$B,2,FALSE)","v":"CBL/T"},15210,{"$f":"VLOOKUP(B29,[1]Eproject!$A:$C,3,FALSE)","v":"MOC"},{"$f":"VLOOKUP(B29,[1]Eproject!$A:$E,5,FALSE)","v":"Add Container for Maintenance & Instrument Storeroom near SCTF Control Building"},{"$f":"VLOOKUP(B29,[1]Eproject!$A:$U,21,FALSE)","v":"973371676"},{"$f":"VLOOKUP(B29,[1]Eproject!$A:$J,10,FALSE)","v":"Wang Shicheng"},{"$f":"VLOOKUP(B29,[1]Eproject!$A:$P,16,FALSE)","v":"2015-09-30"},{"$f":"VLOOKUP(E29,'[1]actual cost'!$F:$G,2,FALSE)","v":{"v":21050,"d":"21,050 "}},{"$f":"VLOOKUP(E29,'[1]actual cost'!$F:$H,3,FALSE)","v":{"v":22850,"d":"22,850 "}},{"$f":"VLOOKUP(E29,'[1]actual cost'!$F:$I,4,FALSE)","v":{"v":3557.74,"d":"3,558 "}},{"v":19292.260000000002,"d":"19,292"},{"v":22850,"d":"22,850 "},{"v":0.16901377672209025,"d":"16.90%"}]
[{"$f":"VLOOKUP(B30,[1]Eproject!$A:$B,2,FALSE)","v":"CBP/M"},15208,{"$f":"VLOOKUP(B30,[1]Eproject!$A:$C,3,FALSE)","v":"MOC"},{"$f":"VLOOKUP(B30,[1]Eproject!$A:$E,5,FALSE)","v":"Leakage of the Roof of MCC of EB/SM Plant"},{"$f":"VLOOKUP(B30,[1]Eproject!$A:$U,21,FALSE)","v":"973314814"},{"$f":"VLOOKUP(B30,[1]Eproject!$A:$J,10,FALSE)","v":"Wang Shicheng"},{"$f":"VLOOKUP(B30,[1]Eproject!$A:$P,16,FALSE)","v":"00:00:00"},{"$f":"VLOOKUP(E30,'[1]actual cost'!$F:$G,2,FALSE)","v":{"v":0,"d":"0 "}},{"$f":"VLOOKUP(E30,'[1]actual cost'!$F:$H,3,FALSE)","v":{"v":0,"d":"0 "}},{"$f":"VLOOKUP(E30,'[1]actual cost'!$F:$I,4,FALSE)","v":{"v":0,"d":"0 "}},0,{"v":0,"d":"0 "},{"$error":"#DIV/0!"}]
[{"$f":"VLOOKUP(B31,[1]Eproject!$A:$B,2,FALSE)","v":"COO/O"},15205,{"$f":"VLOOKUP(B31,[1]Eproject!$A:$C,3,FALSE)","v":"MOC"},{"$f":"VLOOKUP(B31,[1]Eproject!$A:$E,5,FALSE)","v":"Reduce C3106 Level and Modify C3 BF3 Exhaust Pipeline in C3106"},{"$f":"VLOOKUP(B31,[1]Eproject!$A:$U,21,FALSE)","v":"973347817"},{"$f":"VLOOKUP(B31,[1]Eproject!$A:$J,10,FALSE)","v":"Sun Yan"},{"$f":"VLOOKUP(B31,[1]Eproject!$A:$P,16,FALSE)","v":"00:00:00"},{"$f":"VLOOKUP(E31,'[1]actual cost'!$F:$G,2,FALSE)","v":{"v":96550,"d":"96,550 "}},{"$f":"VLOOKUP(E31,'[1]actual cost'!$F:$H,3,FALSE)","v":{"v":90794.54,"d":"90,795 "}},{"$f":"VLOOKUP(E31,'[1]actual cost'!$F:$I,4,FALSE)","v":{"v":53466.51,"d":"53,467 "}},{"v":37328.02999999999,"d":"37,328"},{"v":90794.54,"d":"90,795 "},{"v":0.5537701708959089,"d":"55.38%"}]
[{"$f":"VLOOKUP(B32,[1]Eproject!$A:$B,2,FALSE)","v":"CBL/O"},15194,{"$f":"VLOOKUP(B32,[1]Eproject!$A:$C,3,FALSE)","v":"MOC"},{"$f":"VLOOKUP(B32,[1]Eproject!$A:$E,5,FALSE)","v":"Relocate the Venting Line of CMHL019B of A511"},{"$f":"VLOOKUP(B32,[1]Eproject!$A:$U,21,FALSE)","v":"973525110"},{"$f":"VLOOKUP(B32,[1]Eproject!$A:$J,10,FALSE)","v":"Zhang Fanwen"},{"$f":"VLOOKUP(B32,[1]Eproject!$A:$P,16,FALSE)","v":"00:00:00"},{"$f":"VLOOKUP(E32,'[1]actual cost'!$F:$G,2,FALSE)","v":{"$error":"#N/A"}},{"$f":"VLOOKUP(E32,'[1]actual cost'!$F:$H,3,FALSE)","v":{"$error":"#N/A"}},{"$f":"VLOOKUP(E32,'[1]actual cost'!$F:$I,4,FALSE)","v":{"$error":"#N/A"}},{"$error":"#N/A"},{"$error":"#N/A"},{"$error":"#N/A"}]
[{"$f":"VLOOKUP(B33,[1]Eproject!$A:$B,2,FALSE)","v":"CBP/P"},15190,{"$f":"VLOOKUP(B33,[1]Eproject!$A:$C,3,FALSE)","v":"MOC"},{"$f":"VLOOKUP(B33,[1]Eproject!$A:$E,5,FALSE)","v":"Add Fence and Door for Waste Chemical Laydown"},{"$f":"VLOOKUP(B33,[1]Eproject!$A:$U,21,FALSE)","v":"973308117"},{"$f":"VLOOKUP(B33,[1]Eproject!$A:$J,10,FALSE)","v":"Xia Qun"},{"$f":"VLOOKUP(B33,[1]Eproject!$A:$P,16,FALSE)","v":"00:00:00"},{"$f":"VLOOKUP(E33,'[1]actual cost'!$F:$G,2,FALSE)","v":{"v":108000,"d":"108,000 "}},{"$f":"VLOOKUP(E33,'[1]actual cost'!$F:$H,3,FALSE)","v":{"v":76450,"d":"76,450 "}},{"$f":"VLOOKUP(E33,'[1]actual cost'!$F:$I,4,FALSE)","v":{"v":0,"d":"0 "}},{"v":76450,"d":"76,450"},{"v":76450,"d":"76,450 "},{"v":0,"d":"0.00%"}]
[{"$f":"VLOOKUP(B34,[1]Eproject!$A:$B,2,FALSE)","v":"COO/O"},15189,{"$f":"VLOOKUP(B34,[1]Eproject!$A:$C,3,FALSE)","v":"MOC"},{"$f":"VLOOKUP(B34,[1]Eproject!$A:$E,5,FALSE)","v":"Add Mannual Switch for Shutdown and Startup Fresh Air System of HVAC in Control Room or DCS"},{"$f":"VLOOKUP(B34,[1]Eproject!$A:$U,21,FALSE)","v":"973335860"},{"$f":"VLOOKUP(B34,[1]Eproject!$A:$J,10,FALSE)","v":"Gao Feng"},{"$f":"VLOOKUP(B34,[1]Eproject!$A:$P,16,FALSE)","v":"00:00:00"},{"$f":"VLOOKUP(E34,'[1]actual cost'!$F:$G,2,FALSE)","v":{"v":85000,"d":"85,000 "}},{"$f":"VLOOKUP(E34,'[1]actual cost'!$F:$H,3,FALSE)","v":{"v":66405,"d":"66,405 "}},{"$f":"VLOOKUP(E34,'[1]actual cost'!$F:$I,4,FALSE)","v":{"v":20740,"d":"20,740 "}},{"v":45665,"d":"45,665"},{"v":66405,"d":"66,405 "},{"v":0.244,"d":"24.40%"}]
[{"$f":"VLOOKUP(B35,[1]Eproject!$A:$B,2,FALSE)","v":"CBL/O"},15187,{"$f":"VLOOKUP(B35,[1]Eproject!$A:$C,3,FALSE)","v":"MOC"},{"$f":"VLOOKUP(B35,[1]Eproject!$A:$E,5,FALSE)","v":"Add Temperature Control for 99% FA of Z3950"},{"$f":"VLOOKUP(B35,[1]Eproject!$A:$U,21,FALSE)","v":"973421119"},{"$f":"VLOOKUP(B35,[1]Eproject!$A:$J,10,FALSE)","v":"Gong Feibao"},{"$f":"VLOOKUP(B35,[1]Eproject!$A:$P,16,FALSE)","v":"00:00:00"},{"$f":"VLOOKUP(E35,'[1]actual cost'!$F:$G,2,FALSE)","v":{"v":107750,"d":"107,750 "}},{"$f":"VLOOKUP(E35,'[1]actual cost'!$F:$H,3,FALSE)","v":{"v":98250,"d":"98,250 "}},{"$f":"VLOOKUP(E35,'[1]actual cost'!$F:$I,4,FALSE)","v":{"v":37117.56,"d":"37,118 "}},{"v":61132.44,"d":"61,132"},{"v":98250,"d":"98,250 "},{"v":0.34447851508120647,"d":"34.45%"}]
[{"$f":"VLOOKUP(B36,[1]Eproject!$A:$B,2,FALSE)","v":"CBL/P"},15181,{"$f":"VLOOKUP(B36,[1]Eproject!$A:$C,3,FALSE)","v":"MOC"},{"$f":"VLOOKUP(B36,[1]Eproject!$A:$E,5,FALSE)","v":"Move Switch of Fresh Air System to Control Room"},{"$f":"VLOOKUP(B36,[1]Eproject!$A:$U,21,FALSE)","v":"973353778"},{"$f":"VLOOKUP(B36,[1]Eproject!$A:$J,10,FALSE)","v":"Gao Feng"},{"$f":"VLOOKUP(B36,[1]Eproject!$A:$P,16,FALSE)","v":"2015-11-26"},{"$f":"VLOOKUP(E36,'[1]actual cost'!$F:$G,2,FALSE)","v":{"v":85050,"d":"85,050 "}},{"$f":"VLOOKUP(E36,'[1]actual cost'!$F:$H,3,FALSE)","v":{"v":65050,"d":"65,050 "}},{"$f":"VLOOKUP(E36,'[1]actual cost'!$F:$I,4,FALSE)","v":{"v":20692.31,"d":"20,692 "}},{"v":44357.69,"d":"44,358"},{"v":65050,"d":"65,050 "},{"v":0.2432958259847149,"d":"24.33%"}]
[{"$f":"VLOOKUP(B37,[1]Eproject!$A:$B,2,FALSE)","v":"COA/S"},15177,{"$f":"VLOOKUP(B37,[1]Eproject!$A:$C,3,FALSE)","v":"MOC"},{"$f":"VLOOKUP(B37,[1]Eproject!$A:$E,5,FALSE)","v":"Install New Platforms in the Production Building"},{"$f":"VLOOKUP(B37,[1]Eproject!$A:$U,21,FALSE)","v":"973485229"},{"$f":"VLOOKUP(B37,[1]Eproject!$A:$J,10,FALSE)","v":"Yu Yi"},{"$f":"VLOOKUP(B37,[1]Eproject!$A:$P,16,FALSE)","v":"00:00:00"},{"$f":"VLOOKUP(E37,'[1]actual cost'!$F:$G,2,FALSE)","v":{"v":411548,"d":"411,548 "}},{"$f":"VLOOKUP(E37,'[1]actual cost'!$F:$H,3,FALSE)","v":{"v":220075,"d":"220,075 "}},{"$f":"VLOOKUP(E37,'[1]actual cost'!$F:$I,4,FALSE)","v":{"v":5500,"d":"5,500 "}},{"v":214575,"d":"214,575"},{"v":220075,"d":"220,075 "},{"v":0.013364176232177049,"d":"1.34%"}]
[{"$f":"VLOOKUP(B38,[1]Eproject!$A:$B,2,FALSE)","v":"CEP/E"},15175,{"$f":"VLOOKUP(B38,[1]Eproject!$A:$C,3,FALSE)","v":"MOC"},{"$f":"VLOOKUP(B38,[1]Eproject!$A:$E,5,FALSE)","v":"Add a Balance Line between the V5150&V5152"},{"$f":"VLOOKUP(B38,[1]Eproject!$A:$U,21,FALSE)","v":"973458544"},{"$f":"VLOOKUP(B38,[1]Eproject!$A:$J,10,FALSE)","v":"Gu Jingfeng"},{"$f":"VLOOKUP(B38,[1]Eproject!$A:$P,16,FALSE)","v":"00:00:00"},{"$f":"VLOOKUP(E38,'[1]actual cost'!$F:$G,2,FALSE)","v":{"v":117500,"d":"117,500 "}},{"$f":"VLOOKUP(E38,'[1]actual cost'!$F:$H,3,FALSE)","v":{"v":96300,"d":"96,300 "}},{"$f":"VLOOKUP(E38,'[1]actual cost'!$F:$I,4,FALSE)","v":{"v":14245.14,"d":"14,245 "}},{"v":82054.86,"d":"82,055"},{"v":96300,"d":"96,300 "},{"v":0.12123523404255318,"d":"12.12%"}]
[{"$f":"VLOOKUP(B39,[1]Eproject!$A:$B,2,FALSE)","v":"COA/A"},15173,{"$f":"VLOOKUP(B39,[1]Eproject!$A:$C,3,FALSE)","v":"MOC"},{"$f":"VLOOKUP(B39,[1]Eproject!$A:$E,5,FALSE)","v":"Modification for Heat Tracing of Melted Salt Pipeline"},{"$f":"VLOOKUP(B39,[1]Eproject!$A:$U,21,FALSE)","v":"973470745"},{"$f":"VLOOKUP(B39,[1]Eproject!$A:$J,10,FALSE)","v":"Xu Jin"},{"$f":"VLOOKUP(B39,[1]Eproject!$A:$P,16,FALSE)","v":"00:00:00"},{"$f":"VLOOKUP(E39,'[1]actual cost'!$F:$G,2,FALSE)","v":{"v":265000,"d":"265,000 "}},{"$f":"VLOOKUP(E39,'[1]actual cost'!$F:$H,3,FALSE)","v":{"v":135900,"d":"135,900 "}},{"$f":"VLOOKUP(E39,'[1]actual cost'!$F:$I,4,FALSE)","v":{"v":6200,"d":"6,200 "}},{"v":129700,"d":"129,700"},{"v":135900,"d":"135,900 "},{"v":0.02339622641509434,"d":"2.34%"}]
[{"$f":"VLOOKUP(B40,[1]Eproject!$A:$B,2,FALSE)","v":"CTM"},15170,{"$f":"VLOOKUP(B40,[1]Eproject!$A:$C,3,FALSE)","v":"MOC"},{"$f":"VLOOKUP(B40,[1]Eproject!$A:$E,5,FALSE)","v":"YBS Warehouse Covered Work Site Zone Increase"},{"$f":"VLOOKUP(B40,[1]Eproject!$A:$U,21,FALSE)","v":"973371675"},{"$f":"VLOOKUP(B40,[1]Eproject!$A:$J,10,FALSE)","v":"Yu Yi"},{"$f":"VLOOKUP(B40,[1]Eproject!$A:$P,16,FALSE)","v":"00:00:00"},{"$f":"VLOOKUP(E40,'[1]actual cost'!$F:$G,2,FALSE)","v":{"v":439000,"d":"439,000 "}},{"$f":"VLOOKUP(E40,'[1]actual cost'!$F:$H,3,FALSE)","v":{"v":311967.9,"d":"311,968 "}},{"$f":"VLOOKUP(E40,'[1]actual cost'!$F:$I,4,FALSE)","v":{"v":42571.41,"d":"42,571 "}},{"v":269396.49,"d":"269,396"},{"v":311967.9,"d":"311,968 "},{"v":0.09697359908883828,"d":"9.70%"}]
[{"$f":"VLOOKUP(B41,[1]Eproject!$A:$B,2,FALSE)","v":"CBP/C"},15165,{"$f":"VLOOKUP(B41,[1]Eproject!$A:$C,3,FALSE)","v":"MOC"},{"$f":"VLOOKUP(B41,[1]Eproject!$A:$E,5,FALSE)","v":"Replace the Air Condition of the Switch Room D-110"},{"$f":"VLOOKUP(B41,[1]Eproject!$A:$U,21,FALSE)","v":"973327841"},{"$f":"VLOOKUP(B41,[1]Eproject!$A:$J,10,FALSE)","v":"Wang Shicheng"},{"$f":"VLOOKUP(B41,[1]Eproject!$A:$P,16,FALSE)","v":"2015-10-23"},{"$f":"VLOOKUP(E41,'[1]actual cost'!$F:$G,2,FALSE)","v":{"v":26000,"d":"26,000 "}},{"$f":"VLOOKUP(E41,'[1]actual cost'!$F:$H,3,FALSE)","v":{"v":23920,"d":"23,920 "}},{"$f":"VLOOKUP(E41,'[1]actual cost'!$F:$I,4,FALSE)","v":{"v":10827.36,"d":"10,827 "}},{"v":13092.64,"d":"13,093"},{"v":23920,"d":"23,920 "},{"v":0.4164369230769231,"d":"41.64%"}]
[{"$f":"VLOOKUP(B42,[1]Eproject!$A:$B,2,FALSE)","v":"COO/O"},15162,{"$f":"VLOOKUP(B42,[1]Eproject!$A:$C,3,FALSE)","v":"MOC"},{"$f":"VLOOKUP(B42,[1]Eproject!$A:$E,5,FALSE)","v":"Move the Flammable Gas Cylinder from Laboratory to Cylinder Room and Install Introduction of Pipeline"},{"$f":"VLOOKUP(B42,[1]Eproject!$A:$U,21,FALSE)","v":"973364287"},{"$f":"VLOOKUP(B42,[1]Eproject!$A:$J,10,FALSE)","v":"Liu Xiaoli"},{"$f":"VLOOKUP(B42,[1]Eproject!$A:$P,16,FALSE)","v":"2015-10-20"},{"$f":"VLOOKUP(E42,'[1]actual cost'!$F:$G,2,FALSE)","v":{"v":28810,"d":"28,810 "}},{"$f":"VLOOKUP(E42,'[1]actual cost'!$F:$H,3,FALSE)","v":{"v":27761.27,"d":"27,761 "}},{"$f":"VLOOKUP(E42,'[1]actual cost'!$F:$I,4,FALSE)","v":{"v":17951.46,"d":"17,951 "}},{"v":9809.810000000001,"d":"9,810"},{"v":27761.27,"d":"27,761 "},{"v":0.6230982297813259,"d":"62.31%"}]
[{"$f":"VLOOKUP(B43,[1]Eproject!$A:$B,2,FALSE)","v":"CBP/S"},15161,{"$f":"VLOOKUP(B43,[1]Eproject!$A:$C,3,FALSE)","v":"MOC"},{"$f":"VLOOKUP(B43,[1]Eproject!$A:$E,5,FALSE)","v":"Add 2 Footpath near U1621 and Z1901"},{"$f":"VLOOKUP(B43,[1]Eproject!$A:$U,21,FALSE)","v":"973379812"},{"$f":"VLOOKUP(B43,[1]Eproject!$A:$J,10,FALSE)","v":"Yan Jun"},{"$f":"VLOOKUP(B43,[1]Eproject!$A:$P,16,FALSE)","v":"2015-09-30"},{"$f":"VLOOKUP(E43,'[1]actual cost'!$F:$G,2,FALSE)","v":{"v":45000,"d":"45,000 "}},{"$f":"VLOOKUP(E43,'[1]actual cost'!$F:$H,3,FALSE)","v":{"v":42717,"d":"42,717 "}},{"$f":"VLOOKUP(E43,'[1]actual cost'!$F:$I,4,FALSE)","v":{"v":28611.36,"d":"28,611 "}},{"v":14105.64,"d":"14,106"},{"v":42717,"d":"42,717 "},{"v":0.635808,"d":"63.58%"}]
[{"$f":"VLOOKUP(B44,[1]Eproject!$A:$B,2,FALSE)","v":"CEP/P"},15158,{"$f":"VLOOKUP(B44,[1]Eproject!$A:$C,3,FALSE)","v":"MOC"},{"$f":"VLOOKUP(B44,[1]Eproject!$A:$E,5,FALSE)","v":"Add HVAC for B150 Workshop"},{"$f":"VLOOKUP(B44,[1]Eproject!$A:$U,21,FALSE)","v":"973388920"},{"$f":"VLOOKUP(B44,[1]Eproject!$A:$J,10,FALSE)","v":"Gao Feng"},{"$f":"VLOOKUP(B44,[1]Eproject!$A:$P,16,FALSE)","v":"2015-12-03"},{"$f":"VLOOKUP(E44,'[1]actual cost'!$F:$G,2,FALSE)","v":{"v":106075,"d":"106,075 "}},{"$f":"VLOOKUP(E44,'[1]actual cost'!$F:$H,3,FALSE)","v":{"v":96575,"d":"96,575 "}},{"$f":"VLOOKUP(E44,'[1]actual cost'!$F:$I,4,FALSE)","v":{"v":41331.02,"d":"41,331 "}},{"v":55243.98,"d":"55,244"},{"v":96575,"d":"96,575 "},{"v":0.38963959462644354,"d":"38.96%"}]
[{"$f":"VLOOKUP(B45,[1]Eproject!$A:$B,2,FALSE)","v":"COA/E"},15157,{"$f":"VLOOKUP(B45,[1]Eproject!$A:$C,3,FALSE)","v":"MOC"},{"$f":"VLOOKUP(B45,[1]Eproject!$A:$E,5,FALSE)","v":"Install a Piperack Layout for AE"},{"$f":"VLOOKUP(B45,[1]Eproject!$A:$U,21,FALSE)","v":"973334427"},{"$f":"VLOOKUP(B45,[1]Eproject!$A:$J,10,FALSE)","v":"Yu Yi"},{"$f":"VLOOKUP(B45,[1]Eproject!$A:$P,16,FALSE)","v":"2015-09-14"},{"$f":"VLOOKUP(E45,'[1]actual cost'!$F:$G,2,FALSE)","v":{"v":34500,"d":"34,500 "}},{"$f":"VLOOKUP(E45,'[1]actual cost'!$F:$H,3,FALSE)","v":{"v":33078,"d":"33,078 "}},{"$f":"VLOOKUP(E45,'[1]actual cost'!$F:$I,4,FALSE)","v":{"v":30389.36,"d":"30,389 "}},{"v":2688.6399999999994,"d":"2,689"},{"v":33078,"d":"33,078 "},{"v":0.8808510144927536,"d":"88.09%"}]
[{"$f":"VLOOKUP(B46,[1]Eproject!$A:$B,2,FALSE)","v":"COA/E"},15151,{"$f":"VLOOKUP(B46,[1]Eproject!$A:$C,3,FALSE)","v":"MOC"},{"$f":"VLOOKUP(B46,[1]Eproject!$A:$E,5,FALSE)","v":"Modified the Steel Beam above V6650"},{"$f":"VLOOKUP(B46,[1]Eproject!$A:$U,21,FALSE)","v":"973487180"},{"$f":"VLOOKUP(B46,[1]Eproject!$A:$J,10,FALSE)","v":"Yu Yi"},{"$f":"VLOOKUP(B46,[1]Eproject!$A:$P,16,FALSE)","v":"00:00:00"},{"$f":"VLOOKUP(E46,'[1]actual cost'!$F:$G,2,FALSE)","v":{"v":111379,"d":"111,379 "}},{"$f":"VLOOKUP(E46,'[1]actual cost'!$F:$H,3,FALSE)","v":{"v":73700,"d":"73,700 "}},{"$f":"VLOOKUP(E46,'[1]actual cost'!$F:$I,4,FALSE)","v":{"v":2200,"d":"2,200 "}},{"v":71500,"d":"71,500"},{"v":73700,"d":"73,700 "},{"v":0.019752377019007172,"d":"1.98%"}]
[{"$f":"VLOOKUP(B47,[1]Eproject!$A:$B,2,FALSE)","v":"COA/L"},15150,{"$f":"VLOOKUP(B47,[1]Eproject!$A:$C,3,FALSE)","v":"MOC"},{"$f":"VLOOKUP(B47,[1]Eproject!$A:$E,5,FALSE)","v":"Add an Anti Dropping Device for A455 Loading Station"},{"$f":"VLOOKUP(B47,[1]Eproject!$A:$U,21,FALSE)","v":"973487181"},{"$f":"VLOOKUP(B47,[1]Eproject!$A:$J,10,FALSE)","v":"Yu Yi"},{"$f":"VLOOKUP(B47,[1]Eproject!$A:$P,16,FALSE)","v":"00:00:00"},{"$f":"VLOOKUP(E47,'[1]actual cost'!$F:$G,2,FALSE)","v":{"v":131145,"d":"131,145 "}},{"$f":"VLOOKUP(E47,'[1]actual cost'!$F:$H,3,FALSE)","v":{"v":79750,"d":"79,750 "}},{"$f":"VLOOKUP(E47,'[1]actual cost'!$F:$I,4,FALSE)","v":{"v":4400,"d":"4,400 "}},{"v":75350,"d":"75,350"},{"v":79750,"d":"79,750 "},{"v":0.0335506500438446,"d":"3.36%"}]
[{"$f":"VLOOKUP(B48,[1]Eproject!$A:$B,2,FALSE)","v":"CBL/O"},15148,{"$f":"VLOOKUP(B48,[1]Eproject!$A:$C,3,FALSE)","v":"MOC"},{"$f":"VLOOKUP(B48,[1]Eproject!$A:$E,5,FALSE)","v":"Relocate the Vent Pipeline of Manhole of L309"},{"$f":"VLOOKUP(B48,[1]Eproject!$A:$U,21,FALSE)","v":"973308295"},{"$f":"VLOOKUP(B48,[1]Eproject!$A:$J,10,FALSE)","v":"Zhang Fanwen"},{"$f":"VLOOKUP(B48,[1]Eproject!$A:$P,16,FALSE)","v":"2015-10-30"},{"$f":"VLOOKUP(E48,'[1]actual cost'!$F:$G,2,FALSE)","v":{"v":125250,"d":"125,250 "}},{"$f":"VLOOKUP(E48,'[1]actual cost'!$F:$H,3,FALSE)","v":{"v":102365,"d":"102,365 "}},{"$f":"VLOOKUP(E48,'[1]actual cost'!$F:$I,4,FALSE)","v":{"v":86989.65,"d":"86,990 "}},{"v":15375.350000000006,"d":"15,375"},{"v":102365,"d":"102,365 "},{"v":0.6945281437125748,"d":"69.45%"}]
[{"$f":"VLOOKUP(B49,[1]Eproject!$A:$B,2,FALSE)","v":"CBL/O"},15145,{"$f":"VLOOKUP(B49,[1]Eproject!$A:$C,3,FALSE)","v":"MOC"},{"$f":"VLOOKUP(B49,[1]Eproject!$A:$E,5,FALSE)","v":"Add HVAC Control Button in C701"},{"$f":"VLOOKUP(B49,[1]Eproject!$A:$U,21,FALSE)","v":"973353779"},{"$f":"VLOOKUP(B49,[1]Eproject!$A:$J,10,FALSE)","v":"Gao Feng"},{"$f":"VLOOKUP(B49,[1]Eproject!$A:$P,16,FALSE)","v":"2015-11-26"},{"$f":"VLOOKUP(E49,'[1]actual cost'!$F:$G,2,FALSE)","v":{"v":81050,"d":"81,050 "}},{"$f":"VLOOKUP(E49,'[1]actual cost'!$F:$H,3,FALSE)","v":{"v":86376.03,"d":"86,376 "}},{"$f":"VLOOKUP(E49,'[1]actual cost'!$F:$I,4,FALSE)","v":{"v":54883.06,"d":"54,883 "}},{"v":31492.97,"d":"31,493"},{"v":86376.03,"d":"86,376 "},{"v":0.6771506477483035,"d":"67.72%"}]
[{"$f":"VLOOKUP(B50,[1]Eproject!$A:$B,2,FALSE)","v":"CBP/M"},15136,{"$f":"VLOOKUP(B50,[1]Eproject!$A:$C,3,FALSE)","v":"MOC"},{"$f":"VLOOKUP(B50,[1]Eproject!$A:$E,5,FALSE)","v":"Relocation for Flowmeter F85012 of Production Waste Water"},{"$f":"VLOOKUP(B50,[1]Eproject!$A:$U,21,FALSE)","v":"973290387"},{"$f":"VLOOKUP(B50,[1]Eproject!$A:$J,10,FALSE)","v":"Zhang Fanwen"},{"$f":"VLOOKUP(B50,[1]Eproject!$A:$P,16,FALSE)","v":"2015-11-28"},{"$f":"VLOOKUP(E50,'[1]actual cost'!$F:$G,2,FALSE)","v":{"v":102100,"d":"102,100 "}},{"$f":"VLOOKUP(E50,'[1]actual cost'!$F:$H,3,FALSE)","v":{"v":34100,"d":"34,100 "}},{"$f":"VLOOKUP(E50,'[1]actual cost'!$F:$I,4,FALSE)","v":{"v":19070,"d":"19,070 "}},{"v":15030,"d":"15,030"},{"v":34100,"d":"34,100 "},{"v":0.18677766895200784,"d":"18.68%"}]
[{"$f":"VLOOKUP(B51,[1]Eproject!$A:$B,2,FALSE)","v":"COO/A"},15135,{"$f":"VLOOKUP(B51,[1]Eproject!$A:$C,3,FALSE)","v":"MOC"},{"$f":"VLOOKUP(B51,[1]Eproject!$A:$E,5,FALSE)","v":"Decrease Viabration of Pipeline from Tower C3100 to C3300"},{"$f":"VLOOKUP(B51,[1]Eproject!$A:$U,21,FALSE)","v":"973304632"},{"$f":"VLOOKUP(B51,[1]Eproject!$A:$J,10,FALSE)","v":"Wang Can"},{"$f":"VLOOKUP(B51,[1]Eproject!$A:$P,16,FALSE)","v":"00:00:00"},{"$f":"VLOOKUP(E51,'[1]actual cost'!$F:$G,2,FALSE)","v":{"v":40000,"d":"40,000 "}},{"$f":"VLOOKUP(E51,'[1]actual cost'!$F:$H,3,FALSE)","v":{"v":36000,"d":"36,000 "}},{"$f":"VLOOKUP(E51,'[1]actual cost'!$F:$I,4,FALSE)","v":{"v":45170,"d":"45,170 "}},0,{"v":45170,"d":"45,170 "},{"v":1.12925,"d":"112.93%"}]
[{"$f":"VLOOKUP(B52,[1]Eproject!$A:$B,2,FALSE)","v":"CEP/E"},15131,{"$f":"VLOOKUP(B52,[1]Eproject!$A:$C,3,FALSE)","v":"MOC"},{"$f":"VLOOKUP(B52,[1]Eproject!$A:$E,5,FALSE)","v":"Modify Storage Place for Empty Containers"},{"$f":"VLOOKUP(B52,[1]Eproject!$A:$U,21,FALSE)","v":"973288013"},{"$f":"VLOOKUP(B52,[1]Eproject!$A:$J,10,FALSE)","v":"Yan Jun"},{"$f":"VLOOKUP(B52,[1]Eproject!$A:$P,16,FALSE)","v":"2015-12-03"},{"$f":"VLOOKUP(E52,'[1]actual cost'!$F:$G,2,FALSE)","v":{"v":261000,"d":"261,000 "}},{"$f":"VLOOKUP(E52,'[1]actual cost'!$F:$H,3,FALSE)","v":{"v":235930,"d":"235,930 "}},{"$f":"VLOOKUP(E52,'[1]actual cost'!$F:$I,4,FALSE)","v":{"v":179206.68,"d":"179,207 "}},{"v":56723.32000000001,"d":"56,723"},{"v":235930,"d":"235,930 "},{"v":0.686615632183908,"d":"68.66%"}]
[{"$f":"VLOOKUP(B53,[1]Eproject!$A:$B,2,FALSE)","v":"CBL/O"},15129,{"$f":"VLOOKUP(B53,[1]Eproject!$A:$C,3,FALSE)","v":"MOC"},{"$f":"VLOOKUP(B53,[1]Eproject!$A:$E,5,FALSE)","v":"Modification of Power Room of A800"},{"$f":"VLOOKUP(B53,[1]Eproject!$A:$U,21,FALSE)","v":"973390465"},{"$f":"VLOOKUP(B53,[1]Eproject!$A:$J,10,FALSE)","v":"Hu Xiao"},{"$f":"VLOOKUP(B53,[1]Eproject!$A:$P,16,FALSE)","v":"00:00:00"},{"$f":"VLOOKUP(E53,'[1]actual cost'!$F:$G,2,FALSE)","v":{"v":125000,"d":"125,000 "}},{"$f":"VLOOKUP(E53,'[1]actual cost'!$F:$H,3,FALSE)","v":{"v":75874,"d":"75,874 "}},{"$f":"VLOOKUP(E53,'[1]actual cost'!$F:$I,4,FALSE)","v":{"v":42490.82,"d":"42,491 "}},{"v":33383.18,"d":"33,383"},{"v":75874,"d":"75,874 "},{"v":0.33992656,"d":"33.99%"}]
[{"$f":"VLOOKUP(B54,[1]Eproject!$A:$B,2,FALSE)","v":"COA/A"},15127,{"$f":"VLOOKUP(B54,[1]Eproject!$A:$C,3,FALSE)","v":"MOC"},{"$f":"VLOOKUP(B54,[1]Eproject!$A:$E,5,FALSE)","v":"Add Tie-in Point for WW Header"},{"$f":"VLOOKUP(B54,[1]Eproject!$A:$U,21,FALSE)","v":"973250501"},{"$f":"VLOOKUP(B54,[1]Eproject!$A:$J,10,FALSE)","v":"Meng Yousheng"},{"$f":"VLOOKUP(B54,[1]Eproject!$A:$P,16,FALSE)","v":"00:00:00"},{"$f":"VLOOKUP(E54,'[1]actual cost'!$F:$G,2,FALSE)","v":{"v":15000,"d":"15,000 "}},{"$f":"VLOOKUP(E54,'[1]actual cost'!$F:$H,3,FALSE)","v":{"v":11000,"d":"11,000 "}},{"$f":"VLOOKUP(E54,'[1]actual cost'!$F:$I,4,FALSE)","v":{"v":11620,"d":"11,620 "}},0,{"v":11620,"d":"11,620 "},{"v":0.7746666666666666,"d":"77.47%"}]
[{"$f":"VLOOKUP(B55,[1]Eproject!$A:$B,2,FALSE)","v":"COA/A"},15126,{"$f":"VLOOKUP(B55,[1]Eproject!$A:$C,3,FALSE)","v":"MOC"},{"$f":"VLOOKUP(B55,[1]Eproject!$A:$E,5,FALSE)","v":"Modification for E541 Drain Line"},{"$f":"VLOOKUP(B55,[1]Eproject!$A:$U,21,FALSE)","v":"973250500"},{"$f":"VLOOKUP(B55,[1]Eproject!$A:$J,10,FALSE)","v":"Meng Yousheng"},{"$f":"VLOOKUP(B55,[1]Eproject!$A:$P,16,FALSE)","v":"00:00:00"},{"$f":"VLOOKUP(E55,'[1]actual cost'!$F:$G,2,FALSE)","v":{"v":25000,"d":"25,000 "}},{"$f":"VLOOKUP(E55,'[1]actual cost'!$F:$H,3,FALSE)","v":{"v":20900,"d":"20,900 "}},{"$f":"VLOOKUP(E55,'[1]actual cost'!$F:$I,4,FALSE)","v":{"v":17400,"d":"17,400 "}},{"v":3500,"d":"3,500"},{"v":20900,"d":"20,900 "},{"v":0.696,"d":"69.60%"}]
[{"$f":"VLOOKUP(B56,[1]Eproject!$A:$B,2,FALSE)","v":"CEP/E"},15123,{"$f":"VLOOKUP(B56,[1]Eproject!$A:$C,3,FALSE)","v":"MOC"},{"$f":"VLOOKUP(B56,[1]Eproject!$A:$E,5,FALSE)","v":"Add a Production Water Pipeline to TOC Pond"},{"$f":"VLOOKUP(B56,[1]Eproject!$A:$U,21,FALSE)","v":"973239639"},{"$f":"VLOOKUP(B56,[1]Eproject!$A:$J,10,FALSE)","v":"Li Jun"},{"$f":"VLOOKUP(B56,[1]Eproject!$A:$P,16,FALSE)","v":"00:00:00"},{"$f":"VLOOKUP(E56,'[1]actual cost'!$F:$G,2,FALSE)","v":{"v":41000,"d":"41,000 "}},{"$f":"VLOOKUP(E56,'[1]actual cost'!$F:$H,3,FALSE)","v":{"v":40700,"d":"40,700 "}},{"$f":"VLOOKUP(E56,'[1]actual cost'!$F:$I,4,FALSE)","v":{"v":42330,"d":"42,330 "}},0,{"v":42330,"d":"42,330 "},{"v":1.032439024390244,"d":"103.24%"}]
[{"$f":"VLOOKUP(B57,[1]Eproject!$A:$B,2,FALSE)","v":"COA/L"},15120,{"$f":"VLOOKUP(B57,[1]Eproject!$A:$C,3,FALSE)","v":"MOC"},{"$f":"VLOOKUP(B57,[1]Eproject!$A:$E,5,FALSE)","v":"Add Driver Room for A400"},{"$f":"VLOOKUP(B57,[1]Eproject!$A:$U,21,FALSE)","v":"973427927"},{"$f":"VLOOKUP(B57,[1]Eproject!$A:$J,10,FALSE)","v":"Yu Yi"},{"$f":"VLOOKUP(B57,[1]Eproject!$A:$P,16,FALSE)","v":"00:00:00"},{"$f":"VLOOKUP(E57,'[1]actual cost'!$F:$G,2,FALSE)","v":{"v":220000,"d":"220,000 "}},{"$f":"VLOOKUP(E57,'[1]actual cost'!$F:$H,3,FALSE)","v":{"v":151335,"d":"151,335 "}},{"$f":"VLOOKUP(E57,'[1]actual cost'!$F:$I,4,FALSE)","v":{"v":17875,"d":"17,875 "}},{"v":133460,"d":"133,460"},{"v":151335,"d":"151,335 "},{"v":0.08125,"d":"8.13%"}]
[{"$f":"VLOOKUP(B58,[1]Eproject!$A:$B,2,FALSE)","v":"CBP/C"},15119,{"$f":"VLOOKUP(B58,[1]Eproject!$A:$C,3,FALSE)","v":"MOC"},{"$f":"VLOOKUP(B58,[1]Eproject!$A:$E,5,FALSE)","v":"Add a Work Platform for the Filter F-230"},{"$f":"VLOOKUP(B58,[1]Eproject!$A:$U,21,FALSE)","v":"973378580"},{"$f":"VLOOKUP(B58,[1]Eproject!$A:$J,10,FALSE)","v":"Wang Shicheng"},{"$f":"VLOOKUP(B58,[1]Eproject!$A:$P,16,FALSE)","v":"2015-12-31"},{"$f":"VLOOKUP(E58,'[1]actual cost'!$F:$G,2,FALSE)","v":{"v":51425,"d":"51,425 "}},{"$f":"VLOOKUP(E58,'[1]actual cost'!$F:$H,3,FALSE)","v":{"v":51425,"d":"51,425 "}},{"$f":"VLOOKUP(E58,'[1]actual cost'!$F:$I,4,FALSE)","v":{"v":31725,"d":"31,725 "}},{"v":19700,"d":"19,700"},{"v":51425,"d":"51,425 "},{"v":0.616917841516772,"d":"61.69%"}]
[{"$f":"VLOOKUP(B59,[1]Eproject!$A:$B,2,FALSE)","v":"CBL/P"},15118,{"$f":"VLOOKUP(B59,[1]Eproject!$A:$C,3,FALSE)","v":"MOC"},{"$f":"VLOOKUP(B59,[1]Eproject!$A:$E,5,FALSE)","v":"Modification for SLOP Piping of Safety Valve of Battery Limit"},{"$f":"VLOOKUP(B59,[1]Eproject!$A:$U,21,FALSE)","v":"973366108"},{"$f":"VLOOKUP(B59,[1]Eproject!$A:$J,10,FALSE)","v":"Zhang Fanwen"},{"$f":"VLOOKUP(B59,[1]Eproject!$A:$P,16,FALSE)","v":"2015-12-28"},{"$f":"VLOOKUP(E59,'[1]actual cost'!$F:$G,2,FALSE)","v":{"v":127720,"d":"127,720 "}},{"$f":"VLOOKUP(E59,'[1]actual cost'!$F:$H,3,FALSE)","v":{"v":117974.34,"d":"117,974 "}},{"$f":"VLOOKUP(E59,'[1]actual cost'!$F:$I,4,FALSE)","v":{"v":55735.4,"d":"55,735 "}},{"v":62238.939999999995,"d":"62,239"},{"v":117974.34,"d":"117,974 "},{"v":0.43638740995928593,"d":"43.64%"}]
[{"$f":"VLOOKUP(B60,[1]Eproject!$A:$B,2,FALSE)","v":"CEP/E"},15115,{"$f":"VLOOKUP(B60,[1]Eproject!$A:$C,3,FALSE)","v":"MOC"},{"$f":"VLOOKUP(B60,[1]Eproject!$A:$E,5,FALSE)","v":"Extend Local Trench at Unloading Station"},{"$f":"VLOOKUP(B60,[1]Eproject!$A:$U,21,FALSE)","v":"973516439"},{"$f":"VLOOKUP(B60,[1]Eproject!$A:$J,10,FALSE)","v":"Yan Jun"},{"$f":"VLOOKUP(B60,[1]Eproject!$A:$P,16,FALSE)","v":"00:00:00"},{"$f":"VLOOKUP(E60,'[1]actual cost'!$F:$G,2,FALSE)","v":{"$error":"#N/A"}},{"$f":"VLOOKUP(E60,'[1]actual cost'!$F:$H,3,FALSE)","v":{"$error":"#N/A"}},{"$f":"VLOOKUP(E60,'[1]actual cost'!$F:$I,4,FALSE)","v":{"$error":"#N/A"}},{"$error":"#N/A"},{"$error":"#N/A"},{"$error":"#N/A"}]
[{"$f":"VLOOKUP(B61,[1]Eproject!$A:$B,2,FALSE)","v":"COA/A"},15113,{"$f":"VLOOKUP(B61,[1]Eproject!$A:$C,3,FALSE)","v":"MOC"},{"$f":"VLOOKUP(B61,[1]Eproject!$A:$E,5,FALSE)","v":"CTM/A Build Spare Parts Storage"},{"$f":"VLOOKUP(B61,[1]Eproject!$A:$U,21,FALSE)","v":"973371671"},{"$f":"VLOOKUP(B61,[1]Eproject!$A:$J,10,FALSE)","v":"Yu Yi"},{"$f":"VLOOKUP(B61,[1]Eproject!$A:$P,16,FALSE)","v":"2015-12-30"},{"$f":"VLOOKUP(E61,'[1]actual cost'!$F:$G,2,FALSE)","v":{"v":116000,"d":"116,000 "}},{"$f":"VLOOKUP(E61,'[1]actual cost'!$F:$H,3,FALSE)","v":{"v":117389,"d":"117,389 "}},{"$f":"VLOOKUP(E61,'[1]actual cost'!$F:$I,4,FALSE)","v":{"v":7150,"d":"7,150 "}},{"v":110239,"d":"110,239"},{"v":117389,"d":"117,389 "},{"v":0.06163793103448276,"d":"6.16%"}]
[{"$f":"VLOOKUP(B62,[1]Eproject!$A:$B,2,FALSE)","v":"CBP/C"},15110,{"$f":"VLOOKUP(B62,[1]Eproject!$A:$C,3,FALSE)","v":"MOC"},{"$f":"VLOOKUP(B62,[1]Eproject!$A:$E,5,FALSE)","v":"Move the Smoking Room to Outside the Control Building"},{"$f":"VLOOKUP(B62,[1]Eproject!$A:$U,21,FALSE)","v":"973389727"},{"$f":"VLOOKUP(B62,[1]Eproject!$A:$J,10,FALSE)","v":"Wang Shicheng"},{"$f":"VLOOKUP(B62,[1]Eproject!$A:$P,16,FALSE)","v":"00:00:00"},{"$f":"VLOOKUP(E62,'[1]actual cost'!$F:$G,2,FALSE)","v":{"v":50675,"d":"50,675 "}},{"$f":"VLOOKUP(E62,'[1]actual cost'!$F:$H,3,FALSE)","v":{"v":51101,"d":"51,101 "}},{"$f":"VLOOKUP(E62,'[1]actual cost'!$F:$I,4,FALSE)","v":{"v":42089.21,"d":"42,089 "}},{"v":9011.79,"d":"9,012"},{"v":51101,"d":"51,101 "},{"v":0.8305714849531327,"d":"83.06%"}]
[{"$f":"VLOOKUP(B63,[1]Eproject!$A:$B,2,FALSE)","v":"COO/C"},15106,{"$f":"VLOOKUP(B63,[1]Eproject!$A:$C,3,FALSE)","v":"MOC"},{"$f":"VLOOKUP(B63,[1]Eproject!$A:$E,5,FALSE)","v":"Revamp T3810 to Store DMA"},{"$f":"VLOOKUP(B63,[1]Eproject!$A:$U,21,FALSE)","v":"973240379"},{"$f":"VLOOKUP(B63,[1]Eproject!$A:$J,10,FALSE)","v":"Liu Xiaoli"},{"$f":"VLOOKUP(B63,[1]Eproject!$A:$P,16,FALSE)","v":"00:00:00"},{"$f":"VLOOKUP(E63,'[1]actual cost'!$F:$G,2,FALSE)","v":{"v":18500,"d":"18,500 "}},{"$f":"VLOOKUP(E63,'[1]actual cost'!$F:$H,3,FALSE)","v":{"v":18500,"d":"18,500 "}},{"$f":"VLOOKUP(E63,'[1]actual cost'!$F:$I,4,FALSE)","v":{"v":12385,"d":"12,385 "}},{"v":6115,"d":"6,115"},{"v":18500,"d":"18,500 "},{"v":0.6694594594594595,"d":"66.95%"}]
[{"$f":"VLOOKUP(B64,[1]Eproject!$A:$B,2,FALSE)","v":"COA/A"},15105,{"$f":"VLOOKUP(B64,[1]Eproject!$A:$C,3,FALSE)","v":"MOC"},{"$f":"VLOOKUP(B64,[1]Eproject!$A:$E,5,FALSE)","v":"Build Garbage Station at GAA Plant"},{"$f":"VLOOKUP(B64,[1]Eproject!$A:$U,21,FALSE)","v":"973246059"},{"$f":"VLOOKUP(B64,[1]Eproject!$A:$J,10,FALSE)","v":"Xia Qun"},{"$f":"VLOOKUP(B64,[1]Eproject!$A:$P,16,FALSE)","v":"00:00:00"},{"$f":"VLOOKUP(E64,'[1]actual cost'!$F:$G,2,FALSE)","v":{"v":327500,"d":"327,500 "}},{"$f":"VLOOKUP(E64,'[1]actual cost'!$F:$H,3,FALSE)","v":{"v":332678,"d":"332,678 "}},{"$f":"VLOOKUP(E64,'[1]actual cost'!$F:$I,4,FALSE)","v":{"v":52179.49,"d":"52,179 "}},{"v":280498.51,"d":"280,499"},{"v":332678,"d":"332,678 "},{"v":0.15932668702290076,"d":"15.93%"}]
[{"$f":"VLOOKUP(B65,[1]Eproject!$A:$B,2,FALSE)","v":"COA/E"},15101,{"$f":"VLOOKUP(B65,[1]Eproject!$A:$C,3,FALSE)","v":"MOC"},{"$f":"VLOOKUP(B65,[1]Eproject!$A:$E,5,FALSE)","v":"Re-install Deluge Valve for T9610"},{"$f":"VLOOKUP(B65,[1]Eproject!$A:$U,21,FALSE)","v":"973389266"},{"$f":"VLOOKUP(B65,[1]Eproject!$A:$J,10,FALSE)","v":"Zhang Fanwen"},{"$f":"VLOOKUP(B65,[1]Eproject!$A:$P,16,FALSE)","v":"00:00:00"},{"$f":"VLOOKUP(E65,'[1]actual cost'!$F:$G,2,FALSE)","v":{"v":127600,"d":"127,600 "}},{"$f":"VLOOKUP(E65,'[1]actual cost'!$F:$H,3,FALSE)","v":{"v":107600,"d":"107,600 "}},{"$f":"VLOOKUP(E65,'[1]actual cost'!$F:$I,4,FALSE)","v":{"v":14300,"d":"14,300 "}},{"v":93300,"d":"93,300"},{"v":107600,"d":"107,600 "},{"v":0.11206896551724138,"d":"11.21%"}]
[{"$f":"VLOOKUP(B66,[1]Eproject!$A:$B,2,FALSE)","v":"CBP/C"},15099,{"$f":"VLOOKUP(B66,[1]Eproject!$A:$C,3,FALSE)","v":"MOC"},{"$f":"VLOOKUP(B66,[1]Eproject!$A:$E,5,FALSE)","v":"Modify Work Platform at the Quench Section"},{"$f":"VLOOKUP(B66,[1]Eproject!$A:$U,21,FALSE)","v":"973377859"},{"$f":"VLOOKUP(B66,[1]Eproject!$A:$J,10,FALSE)","v":"Wang Shicheng"},{"$f":"VLOOKUP(B66,[1]Eproject!$A:$P,16,FALSE)","v":"2015-12-31"},{"$f":"VLOOKUP(E66,'[1]actual cost'!$F:$G,2,FALSE)","v":{"v":23825,"d":"23,825 "}},{"$f":"VLOOKUP(E66,'[1]actual cost'!$F:$H,3,FALSE)","v":{"v":23825,"d":"23,825 "}},{"$f":"VLOOKUP(E66,'[1]actual cost'!$F:$I,4,FALSE)","v":{"v":20335,"d":"20,335 "}},{"v":3490,"d":"3,490"},{"v":23825,"d":"23,825 "},{"v":0.8535152151101784,"d":"85.35%"}]
[{"$f":"VLOOKUP(B67,[1]Eproject!$A:$B,2,FALSE)","v":"COO/C"},15098,{"$f":"VLOOKUP(B67,[1]Eproject!$A:$C,3,FALSE)","v":"MOC"},{"$f":"VLOOKUP(B67,[1]Eproject!$A:$E,5,FALSE)","v":"Improve Ventilation Condition of DCS Engineering Room"},{"$f":"VLOOKUP(B67,[1]Eproject!$A:$U,21,FALSE)","v":"973245543"},{"$f":"VLOOKUP(B67,[1]Eproject!$A:$J,10,FALSE)","v":"Yu Yi"},{"$f":"VLOOKUP(B67,[1]Eproject!$A:$P,16,FALSE)","v":"2015-07-30"},{"$f":"VLOOKUP(E67,'[1]actual cost'!$F:$G,2,FALSE)","v":{"v":28600,"d":"28,600 "}},{"$f":"VLOOKUP(E67,'[1]actual cost'!$F:$H,3,FALSE)","v":{"v":22300,"d":"22,300 "}},{"$f":"VLOOKUP(E67,'[1]actual cost'!$F:$I,4,FALSE)","v":{"v":2865.92,"d":"2,866 "}},{"v":19434.08,"d":"19,434"},{"v":22300,"d":"22,300 "},{"v":0.10020699300699301,"d":"10.02%"}]
[{"$f":"VLOOKUP(B68,[1]Eproject!$A:$B,2,FALSE)","v":"COA/E"},15094,{"$f":"VLOOKUP(B68,[1]Eproject!$A:$C,3,FALSE)","v":"MOC"},{"$f":"VLOOKUP(B68,[1]Eproject!$A:$E,5,FALSE)","v":"Add a Sluice Valve at the Rain Trench from the DMA3 Pit to Rain Total Pit"},{"$f":"VLOOKUP(B68,[1]Eproject!$A:$U,21,FALSE)","v":"973330990"},{"$f":"VLOOKUP(B68,[1]Eproject!$A:$J,10,FALSE)","v":"Zhang Fanwen"},{"$f":"VLOOKUP(B68,[1]Eproject!$A:$P,16,FALSE)","v":"00:00:00"},{"$f":"VLOOKUP(E68,'[1]actual cost'!$F:$G,2,FALSE)","v":{"v":95060,"d":"95,060 "}},{"$f":"VLOOKUP(E68,'[1]actual cost'!$F:$H,3,FALSE)","v":{"v":88035,"d":"88,035 "}},{"$f":"VLOOKUP(E68,'[1]actual cost'!$F:$I,4,FALSE)","v":{"v":48283.19,"d":"48,283 "}},{"$f":"IF(J68>I68,0,I68-J68)","v":{"v":39751.81,"d":"39,752"}},{"$f":"J68+K68","v":{"v":88035,"d":"88,035 "}},{"$f":"J68/H68","v":{"v":0.5079233115926783,"d":"50.79%"}}]
[{"$f":"VLOOKUP(B69,[1]Eproject!$A:$B,2,FALSE)","v":"CTE"},15092,{"$f":"VLOOKUP(B69,[1]Eproject!$A:$C,3,FALSE)","v":"MOC"},{"$f":"VLOOKUP(B69,[1]Eproject!$A:$E,5,FALSE)","v":"Modification for Taffic Facilities"},{"$f":"VLOOKUP(B69,[1]Eproject!$A:$U,21,FALSE)","v":"973245545"},{"$f":"VLOOKUP(B69,[1]Eproject!$A:$J,10,FALSE)","v":"Yu Yi"},{"$f":"VLOOKUP(B69,[1]Eproject!$A:$P,16,FALSE)","v":"00:00:00"},{"$f":"VLOOKUP(E69,'[1]actual cost'!$F:$G,2,FALSE)","v":{"v":499000,"d":"499,000 "}},{"$f":"VLOOKUP(E69,'[1]actual cost'!$F:$H,3,FALSE)","v":{"v":462800,"d":"462,800 "}},{"$f":"VLOOKUP(E69,'[1]actual cost'!$F:$I,4,FALSE)","v":{"v":15950,"d":"15,950 "}},{"v":446850,"d":"446,850"},{"v":462800,"d":"462,800 "},{"v":0.03196392785571142,"d":"3.20%"}]
[{"$f":"VLOOKUP(B70,[1]Eproject!$A:$B,2,FALSE)","v":"COA/S"},15090,{"$f":"VLOOKUP(B70,[1]Eproject!$A:$C,3,FALSE)","v":"MOC"},{"$f":"VLOOKUP(B70,[1]Eproject!$A:$E,5,FALSE)","v":"Extend and Modify the Ditch in Truck Loading Station"},{"$f":"VLOOKUP(B70,[1]Eproject!$A:$U,21,FALSE)","v":"973460235"},{"$f":"VLOOKUP(B70,[1]Eproject!$A:$J,10,FALSE)","v":"Yu Yi"},{"$f":"VLOOKUP(B70,[1]Eproject!$A:$P,16,FALSE)","v":"00:00:00"},{"$f":"VLOOKUP(E70,'[1]actual cost'!$F:$G,2,FALSE)","v":{"v":149000,"d":"149,000 "}},{"$f":"VLOOKUP(E70,'[1]actual cost'!$F:$H,3,FALSE)","v":{"v":66000,"d":"66,000 "}},{"$f":"VLOOKUP(E70,'[1]actual cost'!$F:$I,4,FALSE)","v":{"v":2750,"d":"2,750 "}},{"v":63250,"d":"63,250"},{"v":66000,"d":"66,000 "},{"v":0.018456375838926176,"d":"1.85%"}]
[{"$f":"VLOOKUP(B71,[1]Eproject!$A:$B,2,FALSE)","v":"COA/E"},15084,{"$f":"VLOOKUP(B71,[1]Eproject!$A:$C,3,FALSE)","v":"MOC"},{"$f":"VLOOKUP(B71,[1]Eproject!$A:$E,5,FALSE)","v":"Add Jacket for T9668 Circulate Pipe"},{"$f":"VLOOKUP(B71,[1]Eproject!$A:$U,21,FALSE)","v":"973268793"},{"$f":"VLOOKUP(B71,[1]Eproject!$A:$J,10,FALSE)","v":"Wang Can"},{"$f":"VLOOKUP(B71,[1]Eproject!$A:$P,16,FALSE)","v":"00:00:00"},{"$f":"VLOOKUP(E71,'[1]actual cost'!$F:$G,2,FALSE)","v":{"v":195000,"d":"195,000 "}},{"$f":"VLOOKUP(E71,'[1]actual cost'!$F:$H,3,FALSE)","v":{"v":152580,"d":"152,580 "}},{"$f":"VLOOKUP(E71,'[1]actual cost'!$F:$I,4,FALSE)","v":{"v":80155.81,"d":"80,156 "}},{"v":72424.19,"d":"72,424"},{"v":152580,"d":"152,580 "},{"v":0.4110554358974359,"d":"41.11%"}]
[{"$f":"VLOOKUP(B72,[1]Eproject!$A:$B,2,FALSE)","v":"CTS"},15078,{"$f":"VLOOKUP(B72,[1]Eproject!$A:$C,3,FALSE)","v":"MOC"},{"$f":"VLOOKUP(B72,[1]Eproject!$A:$E,5,FALSE)","v":"B655 C1 Lab Item of Feed Additive"},{"$f":"VLOOKUP(B72,[1]Eproject!$A:$U,21,FALSE)","v":"973209930"},{"$f":"VLOOKUP(B72,[1]Eproject!$A:$J,10,FALSE)","v":"Liu Xiaoli"},{"$f":"VLOOKUP(B72,[1]Eproject!$A:$P,16,FALSE)","v":"2015-06-08"},{"$f":"VLOOKUP(E72,'[1]actual cost'!$F:$G,2,FALSE)","v":{"v":150000,"d":"150,000 "}},{"$f":"VLOOKUP(E72,'[1]actual cost'!$F:$H,3,FALSE)","v":{"v":3283.28,"d":"3,283 "}},{"$f":"VLOOKUP(E72,'[1]actual cost'!$F:$I,4,FALSE)","v":{"v":74271.93,"d":"74,272 "}},0,{"v":74271.93,"d":"74,272 "},{"v":0.4951462,"d":"49.51%"}]
[{"$f":"VLOOKUP(B73,[1]Eproject!$A:$B,2,FALSE)","v":"CTE"},15075,{"$f":"VLOOKUP(B73,[1]Eproject!$A:$C,3,FALSE)","v":"MOC"},{"$f":"VLOOKUP(B73,[1]Eproject!$A:$E,5,FALSE)","v":"Fire Fighting Water Pipe Modification for YBS Admin Building"},{"$f":"VLOOKUP(B73,[1]Eproject!$A:$U,21,FALSE)","v":"973219082"},{"$f":"VLOOKUP(B73,[1]Eproject!$A:$J,10,FALSE)","v":"Zhang Fanwen"},{"$f":"VLOOKUP(B73,[1]Eproject!$A:$P,16,FALSE)","v":"2015-08-19"},{"$f":"VLOOKUP(E73,'[1]actual cost'!$F:$G,2,FALSE)","v":{"v":281000,"d":"281,000 "}},{"$f":"VLOOKUP(E73,'[1]actual cost'!$F:$H,3,FALSE)","v":{"v":308864.2,"d":"308,864 "}},{"$f":"VLOOKUP(E73,'[1]actual cost'!$F:$I,4,FALSE)","v":{"v":194115.59,"d":"194,116 "}},{"v":114748.61000000002,"d":"114,749"},{"v":308864.2,"d":"308,864 "},{"v":0.6908028113879003,"d":"69.08%"}]
[{"$f":"VLOOKUP(B74,[1]Eproject!$A:$B,2,FALSE)","v":"CEP/P"},15073,{"$f":"VLOOKUP(B74,[1]Eproject!$A:$C,3,FALSE)","v":"MOC"},{"$f":"VLOOKUP(B74,[1]Eproject!$A:$E,5,FALSE)","v":"Add a 4\" Tie-in on the VAM Pipe from CLTF to LDPE"},{"$f":"VLOOKUP(B74,[1]Eproject!$A:$U,21,FALSE)","v":"973302646"},{"$f":"VLOOKUP(B74,[1]Eproject!$A:$J,10,FALSE)","v":"Gu Jingfeng"},{"$f":"VLOOKUP(B74,[1]Eproject!$A:$P,16,FALSE)","v":"00:00:00"},{"$f":"VLOOKUP(E74,'[1]actual cost'!$F:$G,2,FALSE)","v":{"v":105850,"d":"105,850 "}},{"$f":"VLOOKUP(E74,'[1]actual cost'!$F:$H,3,FALSE)","v":{"v":90850,"d":"90,850 "}},{"$f":"VLOOKUP(E74,'[1]actual cost'!$F:$I,4,FALSE)","v":{"v":58940.19,"d":"58,940 "}},{"v":31909.809999999998,"d":"31,910"},{"v":90850,"d":"90,850 "},{"v":0.5568274917335853,"d":"55.68%"}]
[{"$f":"VLOOKUP(B75,[1]Eproject!$A:$B,2,FALSE)","v":"COO/A"},15070,{"$f":"VLOOKUP(B75,[1]Eproject!$A:$C,3,FALSE)","v":"MOC"},{"$f":"VLOOKUP(B75,[1]Eproject!$A:$E,5,FALSE)","v":"Optimization of Gas-Liquid Separation Facilities for Off Gas 1, Off Gas 2, Off Gas3 in ACN"},{"$f":"VLOOKUP(B75,[1]Eproject!$A:$U,21,FALSE)","v":"973190332"},{"$f":"VLOOKUP(B75,[1]Eproject!$A:$J,10,FALSE)","v":"Liu Duo"},{"$f":"VLOOKUP(B75,[1]Eproject!$A:$P,16,FALSE)","v":"2015-05-05"},{"$f":"VLOOKUP(E75,'[1]actual cost'!$F:$G,2,FALSE)","v":{"v":65570,"d":"65,570 "}},{"$f":"VLOOKUP(E75,'[1]actual cost'!$F:$H,3,FALSE)","v":{"v":63570,"d":"63,570 "}},{"$f":"VLOOKUP(E75,'[1]actual cost'!$F:$I,4,FALSE)","v":{"v":48970.31,"d":"48,970 "}},{"v":14599.690000000002,"d":"14,600"},{"v":63570,"d":"63,570 "},{"v":0.7468401708098216,"d":"74.68%"}]
[{"$f":"VLOOKUP(B76,[1]Eproject!$A:$B,2,FALSE)","v":"COO/O"},15069,{"$f":"VLOOKUP(B76,[1]Eproject!$A:$C,3,FALSE)","v":"MOC"},{"$f":"VLOOKUP(B76,[1]Eproject!$A:$E,5,FALSE)","v":"The Modification of P1810A/B Input Valve"},{"$f":"VLOOKUP(B76,[1]Eproject!$A:$U,21,FALSE)","v":"973171709"},{"$f":"VLOOKUP(B76,[1]Eproject!$A:$J,10,FALSE)","v":"Yu Xiya"},{"$f":"VLOOKUP(B76,[1]Eproject!$A:$P,16,FALSE)","v":"2015-05-07"},{"$f":"VLOOKUP(E76,'[1]actual cost'!$F:$G,2,FALSE)","v":{"v":42000,"d":"42,000 "}},{"$f":"VLOOKUP(E76,'[1]actual cost'!$F:$H,3,FALSE)","v":{"v":47371.09,"d":"47,371 "}},{"$f":"VLOOKUP(E76,'[1]actual cost'!$F:$I,4,FALSE)","v":{"v":24558.08,"d":"24,558 "}},{"v":22813.009999999995,"d":"22,813"},{"v":47371.09,"d":"47,371 "},{"v":0.5847161904761905,"d":"58.47%"}]
[{"$f":"VLOOKUP(B77,[1]Eproject!$A:$B,2,FALSE)","v":"CBL/T"},15067,{"$f":"VLOOKUP(B77,[1]Eproject!$A:$C,3,FALSE)","v":"MOC"},{"$f":"VLOOKUP(B77,[1]Eproject!$A:$E,5,FALSE)","v":"Lead the Fire Alarm Signal of STT101 to STT301"},{"$f":"VLOOKUP(B77,[1]Eproject!$A:$U,21,FALSE)","v":"973275980"},{"$f":"VLOOKUP(B77,[1]Eproject!$A:$J,10,FALSE)","v":"Bian Jiacai"},{"$f":"VLOOKUP(B77,[1]Eproject!$A:$P,16,FALSE)","v":"00:00:00"},{"$f":"VLOOKUP(E77,'[1]actual cost'!$F:$G,2,FALSE)","v":{"v":123000,"d":"123,000 "}},{"$f":"VLOOKUP(E77,'[1]actual cost'!$F:$H,3,FALSE)","v":{"v":78710,"d":"78,710 "}},{"$f":"VLOOKUP(E77,'[1]actual cost'!$F:$I,4,FALSE)","v":{"v":34421.58,"d":"34,422 "}},{"v":44288.42,"d":"44,288"},{"v":78710,"d":"78,710 "},{"v":0.279850243902439,"d":"27.99%"}]
[{"$f":"VLOOKUP(B78,[1]Eproject!$A:$B,2,FALSE)","v":"COA/A"},15065,{"$f":"VLOOKUP(B78,[1]Eproject!$A:$C,3,FALSE)","v":"MOC"},{"$f":"VLOOKUP(B78,[1]Eproject!$A:$E,5,FALSE)","v":"Extending E340 Platform"},{"$f":"VLOOKUP(B78,[1]Eproject!$A:$U,21,FALSE)","v":"973352580"},{"$f":"VLOOKUP(B78,[1]Eproject!$A:$J,10,FALSE)","v":"Yu Yi"},{"$f":"VLOOKUP(B78,[1]Eproject!$A:$P,16,FALSE)","v":"2015-11-25"},{"$f":"VLOOKUP(E78,'[1]actual cost'!$F:$G,2,FALSE)","v":{"v":167000,"d":"167,000 "}},{"$f":"VLOOKUP(E78,'[1]actual cost'!$F:$H,3,FALSE)","v":{"v":105611,"d":"105,611 "}},{"$f":"VLOOKUP(E78,'[1]actual cost'!$F:$I,4,FALSE)","v":{"v":29264.2,"d":"29,264 "}},{"v":76346.8,"d":"76,347"},{"v":105611,"d":"105,611 "},{"v":0.17523473053892216,"d":"17.52%"}]
[{"$f":"VLOOKUP(B79,[1]Eproject!$A:$B,2,FALSE)","v":"COA/L"},15059,{"$f":"VLOOKUP(B79,[1]Eproject!$A:$C,3,FALSE)","v":"MOC"},{"$f":"VLOOKUP(B79,[1]Eproject!$A:$E,5,FALSE)","v":"Extend the Rainproof Shed of D620 Loading Station"},{"$f":"VLOOKUP(B79,[1]Eproject!$A:$U,21,FALSE)","v":"973244161"},{"$f":"VLOOKUP(B79,[1]Eproject!$A:$J,10,FALSE)","v":"Yu Yi"},{"$f":"VLOOKUP(B79,[1]Eproject!$A:$P,16,FALSE)","v":"2015-11-28"},{"$f":"VLOOKUP(E79,'[1]actual cost'!$F:$G,2,FALSE)","v":{"v":278000,"d":"278,000 "}},{"$f":"VLOOKUP(E79,'[1]actual cost'!$F:$H,3,FALSE)","v":{"v":199583.2,"d":"199,583 "}},{"$f":"VLOOKUP(E79,'[1]actual cost'!$F:$I,4,FALSE)","v":{"v":68317.28,"d":"68,317 "}},{"v":131265.92,"d":"131,266"},{"v":199583.2,"d":"199,583 "},{"v":0.24574561151079136,"d":"24.57%"}]
[{"$f":"VLOOKUP(B80,[1]Eproject!$A:$B,2,FALSE)","v":"COO/C"},15049,{"$f":"VLOOKUP(B80,[1]Eproject!$A:$C,3,FALSE)","v":"MOC"},{"$f":"VLOOKUP(B80,[1]Eproject!$A:$E,5,FALSE)","v":"Demolishing K1200 for PA Expansion Project"},{"$f":"VLOOKUP(B80,[1]Eproject!$A:$U,21,FALSE)","v":"972970641"},{"$f":"VLOOKUP(B80,[1]Eproject!$A:$J,10,FALSE)","v":"Yuan Jinhua"},{"$f":"VLOOKUP(B80,[1]Eproject!$A:$P,16,FALSE)","v":"00:00:00"},{"$f":"VLOOKUP(E80,'[1]actual cost'!$F:$G,2,FALSE)","v":{"v":2403600,"d":"2,403,600 "}},{"$f":"VLOOKUP(E80,'[1]actual cost'!$F:$H,3,FALSE)","v":{"v":3600,"d":"3,600 "}},{"$f":"VLOOKUP(E80,'[1]actual cost'!$F:$I,4,FALSE)","v":{"v":0,"d":"0 "}},{"v":3600,"d":"3,600"},{"v":3600,"d":"3,600 "},{"v":0,"d":"0.00%"}]
[{"$f":"VLOOKUP(B81,[1]Eproject!$A:$B,2,FALSE)","v":"COO/C"},15046,{"$f":"VLOOKUP(B81,[1]Eproject!$A:$C,3,FALSE)","v":"MOC"},{"$f":"VLOOKUP(B81,[1]Eproject!$A:$E,5,FALSE)","v":"Install Card Registration Device"},{"$f":"VLOOKUP(B81,[1]Eproject!$A:$U,21,FALSE)","v":"973120684"},{"$f":"VLOOKUP(B81,[1]Eproject!$A:$J,10,FALSE)","v":"Yan Yicheng"},{"$f":"VLOOKUP(B81,[1]Eproject!$A:$P,16,FALSE)","v":"2015-03-30"},{"$f":"VLOOKUP(E81,'[1]actual cost'!$F:$G,2,FALSE)","v":{"v":79188,"d":"79,188 "}},{"$f":"VLOOKUP(E81,'[1]actual cost'!$F:$H,3,FALSE)","v":{"v":49188,"d":"49,188 "}},{"$f":"VLOOKUP(E81,'[1]actual cost'!$F:$I,4,FALSE)","v":{"v":48355.24,"d":"48,355 "}},{"v":832.760000000002,"d":"833"},{"v":49188,"d":"49,188 "},{"v":0.6106384805778653,"d":"61.06%"}]
[{"$f":"VLOOKUP(B82,[1]Eproject!$A:$B,2,FALSE)","v":"COA/A"},15045,{"$f":"VLOOKUP(B82,[1]Eproject!$A:$C,3,FALSE)","v":"MOC"},{"$f":"VLOOKUP(B82,[1]Eproject!$A:$E,5,FALSE)","v":"Install Platforms for Salt Pump"},{"$f":"VLOOKUP(B82,[1]Eproject!$A:$U,21,FALSE)","v":"973227191"},{"$f":"VLOOKUP(B82,[1]Eproject!$A:$J,10,FALSE)","v":"Yu Yi"},{"$f":"VLOOKUP(B82,[1]Eproject!$A:$P,16,FALSE)","v":"00:00:00"},{"$f":"VLOOKUP(E82,'[1]actual cost'!$F:$G,2,FALSE)","v":{"v":460000,"d":"460,000 "}},{"$f":"VLOOKUP(E82,'[1]actual cost'!$F:$H,3,FALSE)","v":{"v":345080,"d":"345,080 "}},{"$f":"VLOOKUP(E82,'[1]actual cost'!$F:$I,4,FALSE)","v":{"v":57735,"d":"57,735 "}},{"v":287345,"d":"287,345"},{"v":345080,"d":"345,080 "},{"v":0.1255108695652174,"d":"12.55%"}]
[{"$f":"VLOOKUP(B83,[1]Eproject!$A:$B,2,FALSE)","v":"COO/C"},15044,{"$f":"VLOOKUP(B83,[1]Eproject!$A:$C,3,FALSE)","v":"MOC"},{"$f":"VLOOKUP(B83,[1]Eproject!$A:$E,5,FALSE)","v":"Alter Arrestors' Location on PA Off Gas Lines"},{"$f":"VLOOKUP(B83,[1]Eproject!$A:$U,21,FALSE)","v":"973126954"},{"$f":"VLOOKUP(B83,[1]Eproject!$A:$J,10,FALSE)","v":"Yuan Jinhua"},{"$f":"VLOOKUP(B83,[1]Eproject!$A:$P,16,FALSE)","v":"2015-03-30"},{"$f":"VLOOKUP(E83,'[1]actual cost'!$F:$G,2,FALSE)","v":{"v":15790,"d":"15,790 "}},{"$f":"VLOOKUP(E83,'[1]actual cost'!$F:$H,3,FALSE)","v":{"v":25790,"d":"25,790 "}},{"$f":"VLOOKUP(E83,'[1]actual cost'!$F:$I,4,FALSE)","v":{"v":18545,"d":"18,545 "}},{"v":7245,"d":"7,245"},{"v":25790,"d":"25,790 "},{"v":1.1744775174160862,"d":"117.45%"}]
[{"$f":"VLOOKUP(B84,[1]Eproject!$A:$B,2,FALSE)","v":"CEP/L"},15043,{"$f":"VLOOKUP(B84,[1]Eproject!$A:$C,3,FALSE)","v":"MOC"},{"$f":"VLOOKUP(B84,[1]Eproject!$A:$E,5,FALSE)","v":"Revamp the Gound of A915 with Epoxy Resin"},{"$f":"VLOOKUP(B84,[1]Eproject!$A:$U,21,FALSE)","v":"973143414"},{"$f":"VLOOKUP(B84,[1]Eproject!$A:$J,10,FALSE)","v":"Xia Qun"},{"$f":"VLOOKUP(B84,[1]Eproject!$A:$P,16,FALSE)","v":"2015-09-30"},{"$f":"VLOOKUP(E84,'[1]actual cost'!$F:$G,2,FALSE)","v":{"v":658000,"d":"658,000 "}},{"$f":"VLOOKUP(E84,'[1]actual cost'!$F:$H,3,FALSE)","v":{"v":584225,"d":"584,225 "}},{"$f":"VLOOKUP(E84,'[1]actual cost'!$F:$I,4,FALSE)","v":{"v":509100.8,"d":"509,101 "}},{"v":75124.20000000001,"d":"75,124"},{"v":584225,"d":"584,225 "},{"v":0.7737094224924012,"d":"77.37%"}]
[{"$f":"VLOOKUP(B85,[1]Eproject!$A:$B,2,FALSE)","v":"COO/C"},15018,{"$f":"VLOOKUP(B85,[1]Eproject!$A:$C,3,FALSE)","v":"MOC"},{"$f":"VLOOKUP(B85,[1]Eproject!$A:$E,5,FALSE)","v":"Revamp Valves and Pipe Connections of Utility Station in C1 Complex"},{"$f":"VLOOKUP(B85,[1]Eproject!$A:$U,21,FALSE)","v":"973358700"},{"$f":"VLOOKUP(B85,[1]Eproject!$A:$J,10,FALSE)","v":"Yuan Jinhua"},{"$f":"VLOOKUP(B85,[1]Eproject!$A:$P,16,FALSE)","v":"00:00:00"},{"$f":"VLOOKUP(E85,'[1]actual cost'!$F:$G,2,FALSE)","v":{"v":18550,"d":"18,550 "}},{"$f":"VLOOKUP(E85,'[1]actual cost'!$F:$H,3,FALSE)","v":{"v":18550,"d":"18,550 "}},{"$f":"VLOOKUP(E85,'[1]actual cost'!$F:$I,4,FALSE)","v":{"v":5205,"d":"5,205 "}},{"v":13345,"d":"13,345"},{"v":18550,"d":"18,550 "},{"v":0.28059299191374665,"d":"28.06%"}]
[{"$f":"VLOOKUP(B86,[1]Eproject!$A:$B,2,FALSE)","v":"COO/C"},15017,{"$f":"VLOOKUP(B86,[1]Eproject!$A:$C,3,FALSE)","v":"MOC"},{"$f":"VLOOKUP(B86,[1]Eproject!$A:$E,5,FALSE)","v":"Revamp HVAC System in C1 Control Building"},{"$f":"VLOOKUP(B86,[1]Eproject!$A:$U,21,FALSE)","v":"973160155"},{"$f":"VLOOKUP(B86,[1]Eproject!$A:$J,10,FALSE)","v":"Gao Feng"},{"$f":"VLOOKUP(B86,[1]Eproject!$A:$P,16,FALSE)","v":"2015-09-18"},{"$f":"VLOOKUP(E86,'[1]actual cost'!$F:$G,2,FALSE)","v":{"v":501000,"d":"501,000 "}},{"$f":"VLOOKUP(E86,'[1]actual cost'!$F:$H,3,FALSE)","v":{"v":168100,"d":"168,100 "}},{"$f":"VLOOKUP(E86,'[1]actual cost'!$F:$I,4,FALSE)","v":{"v":156395.05,"d":"156,395 "}},{"v":11704.950000000012,"d":"11,705"},{"v":168100,"d":"168,100 "},{"v":0.3121657684630738,"d":"31.22%"}]
[{"$f":"VLOOKUP(B87,[1]Eproject!$A:$B,2,FALSE)","v":"CEP/P"},15013,{"$f":"VLOOKUP(B87,[1]Eproject!$A:$C,3,FALSE)","v":"MOC"},{"$f":"VLOOKUP(B87,[1]Eproject!$A:$E,5,FALSE)","v":"Add Two Steam Traps for the P11807 MP Steam"},{"$f":"VLOOKUP(B87,[1]Eproject!$A:$U,21,FALSE)","v":"973160145"},{"$f":"VLOOKUP(B87,[1]Eproject!$A:$J,10,FALSE)","v":"Gu Jingfeng"},{"$f":"VLOOKUP(B87,[1]Eproject!$A:$P,16,FALSE)","v":"2015-09-15"},{"$f":"VLOOKUP(E87,'[1]actual cost'!$F:$G,2,FALSE)","v":{"v":121000,"d":"121,000 "}},{"$f":"VLOOKUP(E87,'[1]actual cost'!$F:$H,3,FALSE)","v":{"v":129806,"d":"129,806 "}},{"$f":"VLOOKUP(E87,'[1]actual cost'!$F:$I,4,FALSE)","v":{"v":90073.94,"d":"90,074 "}},{"v":39732.06,"d":"39,732"},{"v":129806,"d":"129,806 "},{"v":0.7444127272727273,"d":"74.44%"}]
[{"$f":"VLOOKUP(B88,[1]Eproject!$A:$B,2,FALSE)","v":"CBP/S"},15012,{"$f":"VLOOKUP(B88,[1]Eproject!$A:$C,3,FALSE)","v":"MOC"},{"$f":"VLOOKUP(B88,[1]Eproject!$A:$E,5,FALSE)","v":"Add New Water Source for Air Coolers E1741's Sprayers"},{"$f":"VLOOKUP(B88,[1]Eproject!$A:$U,21,FALSE)","v":"973333837"},{"$f":"VLOOKUP(B88,[1]Eproject!$A:$J,10,FALSE)","v":"Chen Chen"},{"$f":"VLOOKUP(B88,[1]Eproject!$A:$P,16,FALSE)","v":"00:00:00"},{"$f":"VLOOKUP(E88,'[1]actual cost'!$F:$G,2,FALSE)","v":{"v":195400,"d":"195,400 "}},{"$f":"VLOOKUP(E88,'[1]actual cost'!$F:$H,3,FALSE)","v":{"v":136400,"d":"136,400 "}},{"$f":"VLOOKUP(E88,'[1]actual cost'!$F:$I,4,FALSE)","v":{"v":2750,"d":"2,750 "}},{"v":133650,"d":"133,650"},{"v":136400,"d":"136,400 "},{"v":0.014073694984646877,"d":"1.41%"}]
[{"$f":"VLOOKUP(B89,[1]Eproject!$A:$B,2,FALSE)","v":"COO/O"},15008,{"$f":"VLOOKUP(B89,[1]Eproject!$A:$C,3,FALSE)","v":"MOC"},{"$f":"VLOOKUP(B89,[1]Eproject!$A:$E,5,FALSE)","v":"Upgrade Open Items According to the Process Safety Review Requirements"},{"$f":"VLOOKUP(B89,[1]Eproject!$A:$U,21,FALSE)","v":"973049116"},{"$f":"VLOOKUP(B89,[1]Eproject!$A:$J,10,FALSE)","v":"Gong Feibao"},{"$f":"VLOOKUP(B89,[1]Eproject!$A:$P,16,FALSE)","v":"2015-09-22"},{"$f":"VLOOKUP(E89,'[1]actual cost'!$F:$G,2,FALSE)","v":{"v":17100,"d":"17,100 "}},{"$f":"VLOOKUP(E89,'[1]actual cost'!$F:$H,3,FALSE)","v":{"v":17100,"d":"17,100 "}},{"$f":"VLOOKUP(E89,'[1]actual cost'!$F:$I,4,FALSE)","v":{"v":20690,"d":"20,690 "}},0,{"v":20690,"d":"20,690 "},{"v":1.2099415204678363,"d":"120.99%"}]
[{"$f":"VLOOKUP(B90,[1]Eproject!$A:$B,2,FALSE)","v":"CBL/P"},15006,{"$f":"VLOOKUP(B90,[1]Eproject!$A:$C,3,FALSE)","v":"MOC"},{"$f":"VLOOKUP(B90,[1]Eproject!$A:$E,5,FALSE)","v":"Revamp HVAC System in CLTF Control Building"},{"$f":"VLOOKUP(B90,[1]Eproject!$A:$U,21,FALSE)","v":"973181190"},{"$f":"VLOOKUP(B90,[1]Eproject!$A:$J,10,FALSE)","v":"Gao Feng"},{"$f":"VLOOKUP(B90,[1]Eproject!$A:$P,16,FALSE)","v":"2015-11-26"},{"$f":"VLOOKUP(E90,'[1]actual cost'!$F:$G,2,FALSE)","v":{"v":364000,"d":"364,000 "}},{"$f":"VLOOKUP(E90,'[1]actual cost'!$F:$H,3,FALSE)","v":{"v":164601.04,"d":"164,601 "}},{"$f":"VLOOKUP(E90,'[1]actual cost'!$F:$I,4,FALSE)","v":{"v":77816.28,"d":"77,816 "}},{"v":86784.76000000001,"d":"86,785"},{"v":164601.04,"d":"164,601 "},{"v":0.21378098901098902,"d":"21.38%"}]
[{"$f":"VLOOKUP(B91,[1]Eproject!$A:$B,2,FALSE)","v":"COO/C"},15005,{"$f":"VLOOKUP(B91,[1]Eproject!$A:$C,3,FALSE)","v":"MOC"},{"$f":"VLOOKUP(B91,[1]Eproject!$A:$E,5,FALSE)","v":"The Revamping of Smoking Room in C1 Plant"},{"$f":"VLOOKUP(B91,[1]Eproject!$A:$U,21,FALSE)","v":"973203335"},{"$f":"VLOOKUP(B91,[1]Eproject!$A:$J,10,FALSE)","v":"Gao Feng"},{"$f":"VLOOKUP(B91,[1]Eproject!$A:$P,16,FALSE)","v":"2015-10-12"},{"$f":"VLOOKUP(E91,'[1]actual cost'!$F:$G,2,FALSE)","v":{"v":89000,"d":"89,000 "}},{"$f":"VLOOKUP(E91,'[1]actual cost'!$F:$H,3,FALSE)","v":{"v":95770,"d":"95,770 "}},{"$f":"VLOOKUP(E91,'[1]actual cost'!$F:$I,4,FALSE)","v":{"v":78586.61,"d":"78,587 "}},{"v":17183.39,"d":"17,183"},{"v":95770,"d":"95,770 "},{"v":0.8829956179775281,"d":"88.30%"}]
[{"$f":"VLOOKUP(B92,[1]Eproject!$A:$B,2,FALSE)","v":"CBP/P"},14322,{"$f":"VLOOKUP(B92,[1]Eproject!$A:$C,3,FALSE)","v":"MOC"},{"$f":"VLOOKUP(B92,[1]Eproject!$A:$E,5,FALSE)","v":"Revamp HVAC System in PP Control Building and Adm. Building"},{"$f":"VLOOKUP(B92,[1]Eproject!$A:$U,21,FALSE)","v":"973189552"},{"$f":"VLOOKUP(B92,[1]Eproject!$A:$J,10,FALSE)","v":"Gao Feng"},{"$f":"VLOOKUP(B92,[1]Eproject!$A:$P,16,FALSE)","v":"2015-09-25"},{"$f":"VLOOKUP(E92,'[1]actual cost'!$F:$G,2,FALSE)","v":{"v":705000,"d":"705,000 "}},{"$f":"VLOOKUP(E92,'[1]actual cost'!$F:$H,3,FALSE)","v":{"v":429317.76,"d":"429,318 "}},{"$f":"VLOOKUP(E92,'[1]actual cost'!$F:$I,4,FALSE)","v":{"v":339749.3,"d":"339,749 "}},{"v":89568.46000000002,"d":"89,568"},{"v":429317.76,"d":"429,318 "},{"v":0.48191390070921986,"d":"48.19%"}]
[{"$f":"VLOOKUP(B93,[1]Eproject!$A:$B,2,FALSE)","v":"CBP/M"},14319,{"$f":"VLOOKUP(B93,[1]Eproject!$A:$C,3,FALSE)","v":"MOC"},{"$f":"VLOOKUP(B93,[1]Eproject!$A:$E,5,FALSE)","v":"Revamping the Ground of Concocting Room of Cooling Water Dosing System"},{"$f":"VLOOKUP(B93,[1]Eproject!$A:$U,21,FALSE)","v":"973035133"},{"$f":"VLOOKUP(B93,[1]Eproject!$A:$J,10,FALSE)","v":"Gao Feng"},{"$f":"VLOOKUP(B93,[1]Eproject!$A:$P,16,FALSE)","v":"2015-06-12"},{"$f":"VLOOKUP(E93,'[1]actual cost'!$F:$G,2,FALSE)","v":{"v":198975,"d":"198,975 "}},{"$f":"VLOOKUP(E93,'[1]actual cost'!$F:$H,3,FALSE)","v":{"v":191500,"d":"191,500 "}},{"$f":"VLOOKUP(E93,'[1]actual cost'!$F:$I,4,FALSE)","v":{"v":145282.23,"d":"145,282 "}},{"v":46217.76999999999,"d":"46,218"},{"v":191500,"d":"191,500 "},{"v":0.7301531850735018,"d":"73.02%"}]
[{"$f":"VLOOKUP(B94,[1]Eproject!$A:$B,2,FALSE)","v":"COO/C"},14301,{"$f":"VLOOKUP(B94,[1]Eproject!$A:$C,3,FALSE)","v":"MOC"},{"$f":"VLOOKUP(B94,[1]Eproject!$A:$E,5,FALSE)","v":"Add Some Manual Valves in DMA Plant"},{"$f":"VLOOKUP(B94,[1]Eproject!$A:$U,21,FALSE)","v":"973043163"},{"$f":"VLOOKUP(B94,[1]Eproject!$A:$J,10,FALSE)","v":"Li Shouqing"},{"$f":"VLOOKUP(B94,[1]Eproject!$A:$P,16,FALSE)","v":"00:00:00"},{"$f":"VLOOKUP(E94,'[1]actual cost'!$F:$G,2,FALSE)","v":{"v":186705,"d":"186,705 "}},{"$f":"VLOOKUP(E94,'[1]actual cost'!$F:$H,3,FALSE)","v":{"v":98105,"d":"98,105 "}},{"$f":"VLOOKUP(E94,'[1]actual cost'!$F:$I,4,FALSE)","v":{"v":154288.59,"d":"154,289 "}},0,{"v":154288.59,"d":"154,289 "},{"v":0.8263763155780509,"d":"82.64%"}]
[{"$f":"VLOOKUP(B95,[1]Eproject!$A:$B,2,FALSE)","v":"CBP/M"},14299,{"$f":"VLOOKUP(B95,[1]Eproject!$A:$C,3,FALSE)","v":"MOC"},{"$f":"VLOOKUP(B95,[1]Eproject!$A:$E,5,FALSE)","v":"Revamping Dry Gas Seal System"},{"$f":"VLOOKUP(B95,[1]Eproject!$A:$U,21,FALSE)","v":"973357432"},{"$f":"VLOOKUP(B95,[1]Eproject!$A:$J,10,FALSE)","v":"Chu Chao"},{"$f":"VLOOKUP(B95,[1]Eproject!$A:$P,16,FALSE)","v":"2015-05-31"},{"$f":"VLOOKUP(E95,'[1]actual cost'!$F:$G,2,FALSE)","v":{"v":91900,"d":"91,900 "}},{"$f":"VLOOKUP(E95,'[1]actual cost'!$F:$H,3,FALSE)","v":{"v":265135.35,"d":"265,135 "}},{"$f":"VLOOKUP(E95,'[1]actual cost'!$F:$I,4,FALSE)","v":{"v":91241.85,"d":"91,242 "}},{"v":173893.49999999997,"d":"173,894"},{"v":265135.35,"d":"265,135 "},{"v":0.9928384113166486,"d":"99.28%"}]
[{"$f":"VLOOKUP(B96,[1]Eproject!$A:$B,2,FALSE)","v":"CBL/T"},14295,{"$f":"VLOOKUP(B96,[1]Eproject!$A:$C,3,FALSE)","v":"MOC"},{"$f":"VLOOKUP(B96,[1]Eproject!$A:$E,5,FALSE)","v":"Relocate the Fire-fighting Monitor WM-L202"},{"$f":"VLOOKUP(B96,[1]Eproject!$A:$U,21,FALSE)","v":"973331498"},{"$f":"VLOOKUP(B96,[1]Eproject!$A:$J,10,FALSE)","v":"Zhang Fanwen"},{"$f":"VLOOKUP(B96,[1]Eproject!$A:$P,16,FALSE)","v":"2015-12-02"},{"$f":"VLOOKUP(E96,'[1]actual cost'!$F:$G,2,FALSE)","v":{"v":97450,"d":"97,450 "}},{"$f":"VLOOKUP(E96,'[1]actual cost'!$F:$H,3,FALSE)","v":{"v":96528,"d":"96,528 "}},{"$f":"VLOOKUP(E96,'[1]actual cost'!$F:$I,4,FALSE)","v":{"v":60646.17,"d":"60,646 "}},{"v":35881.83,"d":"35,882"},{"v":96528,"d":"96,528 "},{"v":0.6223311441765007,"d":"62.23%"}]
[{"$f":"VLOOKUP(B97,[1]Eproject!$A:$B,2,FALSE)","v":"CEP/L"},14289,{"$f":"VLOOKUP(B97,[1]Eproject!$A:$C,3,FALSE)","v":"MOC"},{"$f":"VLOOKUP(B97,[1]Eproject!$A:$E,5,FALSE)","v":"Add Leakage Detectors for Packing Line"},{"$f":"VLOOKUP(B97,[1]Eproject!$A:$U,21,FALSE)","v":"973211318"},{"$f":"VLOOKUP(B97,[1]Eproject!$A:$J,10,FALSE)","v":"Zhou Yanduo"},{"$f":"VLOOKUP(B97,[1]Eproject!$A:$P,16,FALSE)","v":"2015-12-04"},{"$f":"VLOOKUP(E97,'[1]actual cost'!$F:$G,2,FALSE)","v":{"v":371000,"d":"371,000 "}},{"$f":"VLOOKUP(E97,'[1]actual cost'!$F:$H,3,FALSE)","v":{"v":317850,"d":"317,850 "}},{"$f":"VLOOKUP(E97,'[1]actual cost'!$F:$I,4,FALSE)","v":{"v":327307.78,"d":"327,308 "}},0,{"v":327307.78,"d":"327,308 "},{"v":0.8822312129380054,"d":"88.22%"}]
[{"$f":"VLOOKUP(B98,[1]Eproject!$A:$B,2,FALSE)","v":"CEP/E"},14283,{"$f":"VLOOKUP(B98,[1]Eproject!$A:$C,3,FALSE)","v":"MOC"},{"$f":"VLOOKUP(B98,[1]Eproject!$A:$E,5,FALSE)","v":"Seperate 2-PH and DEG Safety Valve Discharge Lines"},{"$f":"VLOOKUP(B98,[1]Eproject!$A:$U,21,FALSE)","v":"972922028"},{"$f":"VLOOKUP(B98,[1]Eproject!$A:$J,10,FALSE)","v":"Wang Zhigao"},{"$f":"VLOOKUP(B98,[1]Eproject!$A:$P,16,FALSE)","v":"2015-05-13"},{"$f":"VLOOKUP(E98,'[1]actual cost'!$F:$G,2,FALSE)","v":{"v":50000,"d":"50,000 "}},{"$f":"VLOOKUP(E98,'[1]actual cost'!$F:$H,3,FALSE)","v":{"v":46200,"d":"46,200 "}},{"$f":"VLOOKUP(E98,'[1]actual cost'!$F:$I,4,FALSE)","v":{"v":48190,"d":"48,190 "}},0,{"v":48190,"d":"48,190 "},{"v":0.9638,"d":"96.38%"}]
[{"$f":"VLOOKUP(B99,[1]Eproject!$A:$B,2,FALSE)","v":"CBP/C"},14280,{"$f":"VLOOKUP(B99,[1]Eproject!$A:$C,3,FALSE)","v":"MOC"},{"$f":"VLOOKUP(B99,[1]Eproject!$A:$E,5,FALSE)","v":"Add Site Lighting Sysyem in Start-up Boiler Section"},{"$f":"VLOOKUP(B99,[1]Eproject!$A:$U,21,FALSE)","v":"973286478"},{"$f":"VLOOKUP(B99,[1]Eproject!$A:$J,10,FALSE)","v":"Hu Xiao"},{"$f":"VLOOKUP(B99,[1]Eproject!$A:$P,16,FALSE)","v":"2015-11-30"},{"$f":"VLOOKUP(E99,'[1]actual cost'!$F:$G,2,FALSE)","v":{"v":147000,"d":"147,000 "}},{"$f":"VLOOKUP(E99,'[1]actual cost'!$F:$H,3,FALSE)","v":{"v":103930.83,"d":"103,931 "}},{"$f":"VLOOKUP(E99,'[1]actual cost'!$F:$I,4,FALSE)","v":{"v":110907.84,"d":"110,908 "}},0,{"v":110907.84,"d":"110,908 "},{"v":0.7544751020408162,"d":"75.45%"}]
[{"$f":"VLOOKUP(B100,[1]Eproject!$A:$B,2,FALSE)","v":"CBP/U"},14269,{"$f":"VLOOKUP(B100,[1]Eproject!$A:$C,3,FALSE)","v":"MOC"},{"$f":"VLOOKUP(B100,[1]Eproject!$A:$E,5,FALSE)","v":"Modify the impeller of P8701"},{"$f":"VLOOKUP(B100,[1]Eproject!$A:$U,21,FALSE)","v":"973343789"},{"$f":"VLOOKUP(B100,[1]Eproject!$A:$J,10,FALSE)","v":"Chen Yuxin"},{"$f":"VLOOKUP(B100,[1]Eproject!$A:$P,16,FALSE)","v":"00:00:00"},{"$f":"VLOOKUP(E100,'[1]actual cost'!$F:$G,2,FALSE)","v":{"v":199180,"d":"199,180 "}},{"$f":"VLOOKUP(E100,'[1]actual cost'!$F:$H,3,FALSE)","v":{"v":174278.4,"d":"174,278 "}},{"$f":"VLOOKUP(E100,'[1]actual cost'!$F:$I,4,FALSE)","v":{"v":48805,"d":"48,805 "}},{"v":125473.4,"d":"125,473"},{"v":174278.4,"d":"174,278 "},{"v":0.24502962144793655,"d":"24.50%"}]
[{"$f":"VLOOKUP(B101,[1]Eproject!$A:$B,2,FALSE)","v":"CBP/U"},14268,{"$f":"VLOOKUP(B101,[1]Eproject!$A:$C,3,FALSE)","v":"MOC"},{"$f":"VLOOKUP(B101,[1]Eproject!$A:$E,5,FALSE)","v":"The Top Flatform of Co-incinerator Expand"},{"$f":"VLOOKUP(B101,[1]Eproject!$A:$U,21,FALSE)","v":"973113995"},{"$f":"VLOOKUP(B101,[1]Eproject!$A:$J,10,FALSE)","v":"Yu Yi"},{"$f":"VLOOKUP(B101,[1]Eproject!$A:$P,16,FALSE)","v":"2015-06-19"},{"$f":"VLOOKUP(E101,'[1]actual cost'!$F:$G,2,FALSE)","v":{"v":224000,"d":"224,000 "}},{"$f":"VLOOKUP(E101,'[1]actual cost'!$F:$H,3,FALSE)","v":{"v":217877.65,"d":"217,878 "}},{"$f":"VLOOKUP(E101,'[1]actual cost'!$F:$I,4,FALSE)","v":{"v":146325.01,"d":"146,325 "}},{"v":71552.63999999998,"d":"71,553"},{"v":217877.65,"d":"217,878 "},{"v":0.6532366517857143,"d":"65.32%"}]
[{"$f":"VLOOKUP(B102,[1]Eproject!$A:$B,2,FALSE)","v":"CEP/E"},14266,{"$f":"VLOOKUP(B102,[1]Eproject!$A:$C,3,FALSE)","v":"MOC"},{"$f":"VLOOKUP(B102,[1]Eproject!$A:$E,5,FALSE)","v":"Change Work Liquid of Z3770-8 from DMW to CW"},{"$f":"VLOOKUP(B102,[1]Eproject!$A:$U,21,FALSE)","v":"972956291"},{"$f":"VLOOKUP(B102,[1]Eproject!$A:$J,10,FALSE)","v":"Wang Zhigao"},{"$f":"VLOOKUP(B102,[1]Eproject!$A:$P,16,FALSE)","v":"2015-05-13"},{"$f":"VLOOKUP(E102,'[1]actual cost'!$F:$G,2,FALSE)","v":{"v":35000,"d":"35,000 "}},{"$f":"VLOOKUP(E102,'[1]actual cost'!$F:$H,3,FALSE)","v":{"v":33120,"d":"33,120 "}},{"$f":"VLOOKUP(E102,'[1]actual cost'!$F:$I,4,FALSE)","v":{"v":32962.82,"d":"32,963 "}},{"v":157.1800000000003,"d":"157"},{"v":33120,"d":"33,120 "},{"v":0.9417948571428572,"d":"94.18%"}]
[{"$f":"VLOOKUP(B103,[1]Eproject!$A:$B,2,FALSE)","v":"CEP/E"},14265,{"$f":"VLOOKUP(B103,[1]Eproject!$A:$C,3,FALSE)","v":"MOC"},{"$f":"VLOOKUP(B103,[1]Eproject!$A:$E,5,FALSE)","v":"Add a Flowmeter on NG to EOEG Flare Pilot Burner"},{"$f":"VLOOKUP(B103,[1]Eproject!$A:$U,21,FALSE)","v":"972956292"},{"$f":"VLOOKUP(B103,[1]Eproject!$A:$J,10,FALSE)","v":"Wang Zhigao"},{"$f":"VLOOKUP(B103,[1]Eproject!$A:$P,16,FALSE)","v":"2015-05-13"},{"$f":"VLOOKUP(E103,'[1]actual cost'!$F:$G,2,FALSE)","v":{"v":40000,"d":"40,000 "}},{"$f":"VLOOKUP(E103,'[1]actual cost'!$F:$H,3,FALSE)","v":{"v":38770,"d":"38,770 "}},{"$f":"VLOOKUP(E103,'[1]actual cost'!$F:$I,4,FALSE)","v":{"v":42120,"d":"42,120 "}},0,{"v":42120,"d":"42,120 "},{"v":1.053,"d":"105.30%"}]
[{"$f":"VLOOKUP(B104,[1]Eproject!$A:$B,2,FALSE)","v":"CBL/T"},14264,{"$f":"VLOOKUP(B104,[1]Eproject!$A:$C,3,FALSE)","v":"MOC"},{"$f":"VLOOKUP(B104,[1]Eproject!$A:$E,5,FALSE)","v":"Add a Container as a Lounge Room at Loading&Unloading Station in SCTF"},{"$f":"VLOOKUP(B104,[1]Eproject!$A:$U,21,FALSE)","v":"973270047"},{"$f":"VLOOKUP(B104,[1]Eproject!$A:$J,10,FALSE)","v":"Wang Shicheng"},{"$f":"VLOOKUP(B104,[1]Eproject!$A:$P,16,FALSE)","v":"2015-11-16"},{"$f":"VLOOKUP(E104,'[1]actual cost'!$F:$G,2,FALSE)","v":{"v":110625,"d":"110,625 "}},{"$f":"VLOOKUP(E104,'[1]actual cost'!$F:$H,3,FALSE)","v":{"v":121158.87,"d":"121,159 "}},{"$f":"VLOOKUP(E104,'[1]actual cost'!$F:$I,4,FALSE)","v":{"v":133864.13,"d":"133,864 "}},0,{"v":133864.13,"d":"133,864 "},{"v":1.2100712316384181,"d":"121.01%"}]
[{"$f":"VLOOKUP(B105,[1]Eproject!$A:$B,2,FALSE)","v":"CBP/C"},14263,{"$f":"VLOOKUP(B105,[1]Eproject!$A:$C,3,FALSE)","v":"MOC"},{"$f":"VLOOKUP(B105,[1]Eproject!$A:$E,5,FALSE)","v":"Change the Pipe Size of Second Burner of Fuel Gas from 3\" to 4\""},{"$f":"VLOOKUP(B105,[1]Eproject!$A:$U,21,FALSE)","v":"973168953"},{"$f":"VLOOKUP(B105,[1]Eproject!$A:$J,10,FALSE)","v":"Chen Chen"},{"$f":"VLOOKUP(B105,[1]Eproject!$A:$P,16,FALSE)","v":"2015-10-30"},{"$f":"VLOOKUP(E105,'[1]actual cost'!$F:$G,2,FALSE)","v":{"v":262200,"d":"262,200 "}},{"$f":"VLOOKUP(E105,'[1]actual cost'!$F:$H,3,FALSE)","v":{"v":172380,"d":"172,380 "}},{"$f":"VLOOKUP(E105,'[1]actual cost'!$F:$I,4,FALSE)","v":{"v":160798.11,"d":"160,798 "}},{"v":11581.890000000014,"d":"11,582"},{"v":172380,"d":"172,380 "},{"v":0.6132651029748283,"d":"61.33%"}]
[{"$f":"VLOOKUP(B106,[1]Eproject!$A:$B,2,FALSE)","v":"COO/A"},14247,{"$f":"VLOOKUP(B106,[1]Eproject!$A:$C,3,FALSE)","v":"MOC"},{"$f":"VLOOKUP(B106,[1]Eproject!$A:$E,5,FALSE)","v":"Add Water Cooler and Inducer for Pumps P2400/P2500/P2600"},{"$f":"VLOOKUP(B106,[1]Eproject!$A:$U,21,FALSE)","v":"972922251"},{"$f":"VLOOKUP(B106,[1]Eproject!$A:$J,10,FALSE)","v":"Liu Duo"},{"$f":"VLOOKUP(B106,[1]Eproject!$A:$P,16,FALSE)","v":"2015-05-25"},{"$f":"VLOOKUP(E106,'[1]actual cost'!$F:$G,2,FALSE)","v":{"v":273200,"d":"273,200 "}},{"$f":"VLOOKUP(E106,'[1]actual cost'!$F:$H,3,FALSE)","v":{"v":34375.19,"d":"34,375 "}},{"$f":"VLOOKUP(E106,'[1]actual cost'!$F:$I,4,FALSE)","v":{"v":384748.11,"d":"384,748 "}},0,{"v":384748.11,"d":"384,748 "},{"v":1.4083020131771595,"d":"140.83%"}]
[{"$f":"VLOOKUP(B107,[1]Eproject!$A:$B,2,FALSE)","v":"CTS/U"},14246,{"$f":"VLOOKUP(B107,[1]Eproject!$A:$C,3,FALSE)","v":"MOC"},{"$f":"VLOOKUP(B107,[1]Eproject!$A:$E,5,FALSE)","v":"Move the Tie-in to SAP HP Steam in TAR"},{"$f":"VLOOKUP(B107,[1]Eproject!$A:$U,21,FALSE)","v":"972924061"},{"$f":"VLOOKUP(B107,[1]Eproject!$A:$J,10,FALSE)","v":"Yu Xiya"},{"$f":"VLOOKUP(B107,[1]Eproject!$A:$P,16,FALSE)","v":"2015-05-07"},{"$f":"VLOOKUP(E107,'[1]actual cost'!$F:$G,2,FALSE)","v":{"v":230000,"d":"230,000 "}},{"$f":"VLOOKUP(E107,'[1]actual cost'!$F:$H,3,FALSE)","v":{"v":235720,"d":"235,720 "}},{"$f":"VLOOKUP(E107,'[1]actual cost'!$F:$I,4,FALSE)","v":{"v":329170.17,"d":"329,170 "}},0,{"v":329170.17,"d":"329,170 "},{"v":1.431174652173913,"d":"143.12%"}]
[{"$f":"VLOOKUP(B108,[1]Eproject!$A:$B,2,FALSE)","v":"COA/A"},14233,{"$f":"VLOOKUP(B108,[1]Eproject!$A:$C,3,FALSE)","v":"MOC"},{"$f":"VLOOKUP(B108,[1]Eproject!$A:$E,5,FALSE)","v":"Extend the Waterproof of Stabilizer Preparation Station"},{"$f":"VLOOKUP(B108,[1]Eproject!$A:$U,21,FALSE)","v":"973236661"},{"$f":"VLOOKUP(B108,[1]Eproject!$A:$J,10,FALSE)","v":"Yu Yi"},{"$f":"VLOOKUP(B108,[1]Eproject!$A:$P,16,FALSE)","v":"00:00:00"},{"$f":"VLOOKUP(E108,'[1]actual cost'!$F:$G,2,FALSE)","v":{"v":186000,"d":"186,000 "}},{"$f":"VLOOKUP(E108,'[1]actual cost'!$F:$H,3,FALSE)","v":{"v":153570,"d":"153,570 "}},{"$f":"VLOOKUP(E108,'[1]actual cost'!$F:$I,4,FALSE)","v":{"v":57842.97,"d":"57,843 "}},{"v":95727.03,"d":"95,727"},{"v":153570,"d":"153,570 "},{"v":0.31098370967741934,"d":"31.10%"}]
[{"$f":"VLOOKUP(B109,[1]Eproject!$A:$B,2,FALSE)","v":"CEP/P"},14228,{"$f":"VLOOKUP(B109,[1]Eproject!$A:$C,3,FALSE)","v":"MOC"},{"$f":"VLOOKUP(B109,[1]Eproject!$A:$E,5,FALSE)","v":"Modify Pellet CW Exchanger to Parallel Mode"},{"$f":"VLOOKUP(B109,[1]Eproject!$A:$U,21,FALSE)","v":"972895397"},{"$f":"VLOOKUP(B109,[1]Eproject!$A:$J,10,FALSE)","v":"Gu Jingfeng"},{"$f":"VLOOKUP(B109,[1]Eproject!$A:$P,16,FALSE)","v":"2015-07-29"},{"$f":"VLOOKUP(E109,'[1]actual cost'!$F:$G,2,FALSE)","v":{"v":219000,"d":"219,000 "}},{"$f":"VLOOKUP(E109,'[1]actual cost'!$F:$H,3,FALSE)","v":{"v":196900,"d":"196,900 "}},{"$f":"VLOOKUP(E109,'[1]actual cost'!$F:$I,4,FALSE)","v":{"v":216369.2,"d":"216,369 "}},0,{"v":216369.2,"d":"216,369 "},{"v":0.9879872146118722,"d":"98.80%"}]
[{"$f":"VLOOKUP(B110,[1]Eproject!$A:$B,2,FALSE)","v":"CEP/L"},14225,{"$f":"VLOOKUP(B110,[1]Eproject!$A:$C,3,FALSE)","v":"MOC"},{"$f":"VLOOKUP(B110,[1]Eproject!$A:$E,5,FALSE)","v":"Repaving the Concrete Ground in PS Warehouse"},{"$f":"VLOOKUP(B110,[1]Eproject!$A:$U,21,FALSE)","v":"973191611"},{"$f":"VLOOKUP(B110,[1]Eproject!$A:$J,10,FALSE)","v":"Gao Feng"},{"$f":"VLOOKUP(B110,[1]Eproject!$A:$P,16,FALSE)","v":"2015-10-29"},{"$f":"VLOOKUP(E110,'[1]actual cost'!$F:$G,2,FALSE)","v":{"v":1294000,"d":"1,294,000 "}},{"$f":"VLOOKUP(E110,'[1]actual cost'!$F:$H,3,FALSE)","v":{"v":1152068,"d":"1,152,068 "}},{"$f":"VLOOKUP(E110,'[1]actual cost'!$F:$I,4,FALSE)","v":{"v":79148.69,"d":"79,149 "}},{"v":1072919.31,"d":"1,072,919"},{"v":1152068,"d":"1,152,068 "},{"v":0.06116591190108192,"d":"6.12%"}]
[{"$f":"VLOOKUP(B111,[1]Eproject!$A:$B,2,FALSE)","v":"COA/S"},14224,{"$f":"VLOOKUP(B111,[1]Eproject!$A:$C,3,FALSE)","v":"MOC"},{"$f":"VLOOKUP(B111,[1]Eproject!$A:$E,5,FALSE)","v":"Modification for Potable Water Line"},{"$f":"VLOOKUP(B111,[1]Eproject!$A:$U,21,FALSE)","v":"972927197"},{"$f":"VLOOKUP(B111,[1]Eproject!$A:$J,10,FALSE)","v":"Xu Jin"},{"$f":"VLOOKUP(B111,[1]Eproject!$A:$P,16,FALSE)","v":"2015-08-07"},{"$f":"VLOOKUP(E111,'[1]actual cost'!$F:$G,2,FALSE)","v":{"v":230000,"d":"230,000 "}},{"$f":"VLOOKUP(E111,'[1]actual cost'!$F:$H,3,FALSE)","v":{"v":204624.28,"d":"204,624 "}},{"$f":"VLOOKUP(E111,'[1]actual cost'!$F:$I,4,FALSE)","v":{"v":173912.62,"d":"173,913 "}},{"v":30711.660000000003,"d":"30,712"},{"v":204624.28,"d":"204,624 "},{"v":0.7561418260869565,"d":"75.61%"}]
[{"$f":"VLOOKUP(B112,[1]Eproject!$A:$B,2,FALSE)","v":"CBP/B"},14221,{"$f":"VLOOKUP(B112,[1]Eproject!$A:$C,3,FALSE)","v":"MOC"},{"$f":"VLOOKUP(B112,[1]Eproject!$A:$E,5,FALSE)","v":"Replace the FV-1503 with a More Suitable Control Valve"},{"$f":"VLOOKUP(B112,[1]Eproject!$A:$U,21,FALSE)","v":"973256493"},{"$f":"VLOOKUP(B112,[1]Eproject!$A:$J,10,FALSE)","v":"Gong Feibao"},{"$f":"VLOOKUP(B112,[1]Eproject!$A:$P,16,FALSE)","v":"00:00:00"},{"$f":"VLOOKUP(E112,'[1]actual cost'!$F:$G,2,FALSE)","v":{"v":179248,"d":"179,248 "}},{"$f":"VLOOKUP(E112,'[1]actual cost'!$F:$H,3,FALSE)","v":{"v":120171.71,"d":"120,172 "}},{"$f":"VLOOKUP(E112,'[1]actual cost'!$F:$I,4,FALSE)","v":{"v":51634.79,"d":"51,635 "}},{"v":68536.92000000001,"d":"68,537"},{"v":120171.71000000002,"d":"120,172 "},{"v":0.28806340935463715,"d":"28.81%"}]
[{"$f":"VLOOKUP(B113,[1]Eproject!$A:$B,2,FALSE)","v":"CEP/S"},14220,{"$f":"VLOOKUP(B113,[1]Eproject!$A:$C,3,FALSE)","v":"MOC"},{"$f":"VLOOKUP(B113,[1]Eproject!$A:$E,5,FALSE)","v":"Replace the Push Button of Electric Motor in CEP/S"},{"$f":"VLOOKUP(B113,[1]Eproject!$A:$U,21,FALSE)","v":"973025628"},{"$f":"VLOOKUP(B113,[1]Eproject!$A:$J,10,FALSE)","v":"Xu Zheng"},{"$f":"VLOOKUP(B113,[1]Eproject!$A:$P,16,FALSE)","v":"00:00:00"},{"$f":"VLOOKUP(E113,'[1]actual cost'!$F:$G,2,FALSE)","v":{"v":366540,"d":"366,540 "}},{"$f":"VLOOKUP(E113,'[1]actual cost'!$F:$H,3,FALSE)","v":{"v":155540,"d":"155,540 "}},{"$f":"VLOOKUP(E113,'[1]actual cost'!$F:$I,4,FALSE)","v":{"v":164287.23,"d":"164,287 "}},0,{"v":164287.23,"d":"164,287 "},{"v":0.4482109183172369,"d":"44.82%"}]
[{"$f":"VLOOKUP(B114,[1]Eproject!$A:$B,2,FALSE)","v":"CBP/C"},14216,{"$f":"VLOOKUP(B114,[1]Eproject!$A:$C,3,FALSE)","v":"MOC"},{"$f":"VLOOKUP(B114,[1]Eproject!$A:$E,5,FALSE)","v":"Add Safe Passage between the Work Platform in PGU Section"},{"$f":"VLOOKUP(B114,[1]Eproject!$A:$U,21,FALSE)","v":"973152182"},{"$f":"VLOOKUP(B114,[1]Eproject!$A:$J,10,FALSE)","v":"Wang Shicheng"},{"$f":"VLOOKUP(B114,[1]Eproject!$A:$P,16,FALSE)","v":"2015-09-21"},{"$f":"VLOOKUP(E114,'[1]actual cost'!$F:$G,2,FALSE)","v":{"v":100000,"d":"100,000 "}},{"$f":"VLOOKUP(E114,'[1]actual cost'!$F:$H,3,FALSE)","v":{"v":78974,"d":"78,974 "}},{"$f":"VLOOKUP(E114,'[1]actual cost'!$F:$I,4,FALSE)","v":{"v":62113.21,"d":"62,113 "}},{"v":16860.79,"d":"16,861"},{"v":78974,"d":"78,974 "},{"v":0.6211321,"d":"62.11%"}]
[{"$f":"VLOOKUP(B115,[1]Eproject!$A:$B,2,FALSE)","v":"CBP/C"},14215,{"$f":"VLOOKUP(B115,[1]Eproject!$A:$C,3,FALSE)","v":"MOC"},{"$f":"VLOOKUP(B115,[1]Eproject!$A:$E,5,FALSE)","v":"Add Work Platform nearby the Flow Meters"},{"$f":"VLOOKUP(B115,[1]Eproject!$A:$U,21,FALSE)","v":"973152181"},{"$f":"VLOOKUP(B115,[1]Eproject!$A:$J,10,FALSE)","v":"Wang Shicheng"},{"$f":"VLOOKUP(B115,[1]Eproject!$A:$P,16,FALSE)","v":"2015-09-21"},{"$f":"VLOOKUP(E115,'[1]actual cost'!$F:$G,2,FALSE)","v":{"v":160000,"d":"160,000 "}},{"$f":"VLOOKUP(E115,'[1]actual cost'!$F:$H,3,FALSE)","v":{"v":132712,"d":"132,712 "}},{"$f":"VLOOKUP(E115,'[1]actual cost'!$F:$I,4,FALSE)","v":{"v":126187.26,"d":"126,187 "}},{"v":6524.740000000005,"d":"6,525"},{"v":132712,"d":"132,712 "},{"v":0.7886703749999999,"d":"78.87%"}]
[{"$f":"VLOOKUP(B116,[1]Eproject!$A:$B,2,FALSE)","v":"CBL/O"},14213,{"$f":"VLOOKUP(B116,[1]Eproject!$A:$C,3,FALSE)","v":"MOC"},{"$f":"VLOOKUP(B116,[1]Eproject!$A:$E,5,FALSE)","v":"Add 3 Wall-fans on the Wall of A605 PALD Drum filling Workshop"},{"$f":"VLOOKUP(B116,[1]Eproject!$A:$U,21,FALSE)","v":"972877642"},{"$f":"VLOOKUP(B116,[1]Eproject!$A:$J,10,FALSE)","v":"Yu Yi"},{"$f":"VLOOKUP(B116,[1]Eproject!$A:$P,16,FALSE)","v":"2015-07-21"},{"$f":"VLOOKUP(E116,'[1]actual cost'!$F:$G,2,FALSE)","v":{"v":261000,"d":"261,000 "}},{"$f":"VLOOKUP(E116,'[1]actual cost'!$F:$H,3,FALSE)","v":{"v":233111.34,"d":"233,111 "}},{"$f":"VLOOKUP(E116,'[1]actual cost'!$F:$I,4,FALSE)","v":{"v":257308.46,"d":"257,308 "}},0,{"v":257308.46,"d":"257,308 "},{"v":0.9858561685823755,"d":"98.59%"}]
[{"$f":"VLOOKUP(B117,[1]Eproject!$A:$B,2,FALSE)","v":"CBP/C"},14212,{"$f":"VLOOKUP(B117,[1]Eproject!$A:$C,3,FALSE)","v":"MOC"},{"$f":"VLOOKUP(B117,[1]Eproject!$A:$E,5,FALSE)","v":"Add N2 and Blowdown Pipe from SCTF to 274 Steel Structure Yixi Road"},{"$f":"VLOOKUP(B117,[1]Eproject!$A:$U,21,FALSE)","v":"972827264"},{"$f":"VLOOKUP(B117,[1]Eproject!$A:$J,10,FALSE)","v":"Chen Chen"},{"$f":"VLOOKUP(B117,[1]Eproject!$A:$P,16,FALSE)","v":"2015-05-09"},{"$f":"VLOOKUP(E117,'[1]actual cost'!$F:$G,2,FALSE)","v":{"v":558000,"d":"558,000 "}},{"$f":"VLOOKUP(E117,'[1]actual cost'!$F:$H,3,FALSE)","v":{"v":537820.92,"d":"537,821 "}},{"$f":"VLOOKUP(E117,'[1]actual cost'!$F:$I,4,FALSE)","v":{"v":637737.12,"d":"637,737 "}},0,{"v":637737.12,"d":"637,737 "},{"v":1.142898064516129,"d":"114.29%"}]
[{"$f":"VLOOKUP(B118,[1]Eproject!$A:$B,2,FALSE)","v":"CAP/A"},14209,{"$f":"VLOOKUP(B118,[1]Eproject!$A:$C,3,FALSE)","v":"MOC"},{"$f":"VLOOKUP(B118,[1]Eproject!$A:$E,5,FALSE)","v":"Modification for F450B/F455A and Add Filters for T9514/16"},{"$f":"VLOOKUP(B118,[1]Eproject!$A:$U,21,FALSE)","v":"972793548"},{"$f":"VLOOKUP(B118,[1]Eproject!$A:$J,10,FALSE)","v":"Zhu Jianxin"},{"$f":"VLOOKUP(B118,[1]Eproject!$A:$P,16,FALSE)","v":"2015-04-30"},{"$f":"VLOOKUP(E118,'[1]actual cost'!$F:$G,2,FALSE)","v":{"v":700000,"d":"700,000 "}},{"$f":"VLOOKUP(E118,'[1]actual cost'!$F:$H,3,FALSE)","v":{"v":360539.74,"d":"360,540 "}},{"$f":"VLOOKUP(E118,'[1]actual cost'!$F:$I,4,FALSE)","v":{"v":631156.96,"d":"631,157 "}},0,{"v":631156.96,"d":"631,157 "},{"v":0.9016527999999999,"d":"90.17%"}]
[{"$f":"VLOOKUP(B119,[1]Eproject!$A:$B,2,FALSE)","v":"CCP/A"},14201,{"$f":"VLOOKUP(B119,[1]Eproject!$A:$C,3,FALSE)","v":"MOC"},{"$f":"VLOOKUP(B119,[1]Eproject!$A:$E,5,FALSE)","v":"Move Mass Flowmeter F23002 from the 2nd Floor to the 1st Floor"},{"$f":"VLOOKUP(B119,[1]Eproject!$A:$U,21,FALSE)","v":"972887482"},{"$f":"VLOOKUP(B119,[1]Eproject!$A:$J,10,FALSE)","v":"Liu Duo"},{"$f":"VLOOKUP(B119,[1]Eproject!$A:$P,16,FALSE)","v":"2015-05-06"},{"$f":"VLOOKUP(E119,'[1]actual cost'!$F:$G,2,FALSE)","v":{"v":70000,"d":"70,000 "}},{"$f":"VLOOKUP(E119,'[1]actual cost'!$F:$H,3,FALSE)","v":{"v":21000,"d":"21,000 "}},{"$f":"VLOOKUP(E119,'[1]actual cost'!$F:$I,4,FALSE)","v":{"v":38518.26,"d":"38,518 "}},0,{"v":38518.26,"d":"38,518 "},{"v":0.5502608571428572,"d":"55.03%"}]
[{"$f":"VLOOKUP(B120,[1]Eproject!$A:$B,2,FALSE)","v":"CEP/P"},14196,{"$f":"VLOOKUP(B120,[1]Eproject!$A:$C,3,FALSE)","v":"MOC"},{"$f":"VLOOKUP(B120,[1]Eproject!$A:$E,5,FALSE)","v":"Add the Vibration Signal into DCS System for K11501&K21501"},{"$f":"VLOOKUP(B120,[1]Eproject!$A:$U,21,FALSE)","v":"972760217"},{"$f":"VLOOKUP(B120,[1]Eproject!$A:$J,10,FALSE)","v":"Shen Liying"},{"$f":"VLOOKUP(B120,[1]Eproject!$A:$P,16,FALSE)","v":"2015-02-06"},{"$f":"VLOOKUP(E120,'[1]actual cost'!$F:$G,2,FALSE)","v":{"v":415000,"d":"415,000 "}},{"$f":"VLOOKUP(E120,'[1]actual cost'!$F:$H,3,FALSE)","v":{"v":197310.43,"d":"197,310 "}},{"$f":"VLOOKUP(E120,'[1]actual cost'!$F:$I,4,FALSE)","v":{"v":552197.25,"d":"552,197 "}},0,{"v":552197.25,"d":"552,197 "},{"v":1.3305957831325301,"d":"133.06%"}]
[{"$f":"VLOOKUP(B121,[1]Eproject!$A:$B,2,FALSE)","v":"CBP/S"},14195,{"$f":"VLOOKUP(B121,[1]Eproject!$A:$C,3,FALSE)","v":"MOC"},{"$f":"VLOOKUP(B121,[1]Eproject!$A:$E,5,FALSE)","v":"Add Polished Condensate Makeup Line to U1621 & U1861"},{"$f":"VLOOKUP(B121,[1]Eproject!$A:$U,21,FALSE)","v":"973041189"},{"$f":"VLOOKUP(B121,[1]Eproject!$A:$J,10,FALSE)","v":"Wang Can"},{"$f":"VLOOKUP(B121,[1]Eproject!$A:$P,16,FALSE)","v":"00:00:00"},{"$f":"VLOOKUP(E121,'[1]actual cost'!$F:$G,2,FALSE)","v":{"v":198950,"d":"198,950 "}},{"$f":"VLOOKUP(E121,'[1]actual cost'!$F:$H,3,FALSE)","v":{"v":153902.74,"d":"153,903 "}},{"$f":"VLOOKUP(E121,'[1]actual cost'!$F:$I,4,FALSE)","v":{"v":47519.08,"d":"47,519 "}},{"v":106383.65999999999,"d":"106,384"},{"v":153902.74,"d":"153,903 "},{"v":0.23884935913546118,"d":"23.88%"}]
[{"$f":"VLOOKUP(B122,[1]Eproject!$A:$B,2,FALSE)","v":"CEP/E"},14189,{"$f":"VLOOKUP(B122,[1]Eproject!$A:$C,3,FALSE)","v":"MOC"},{"$f":"VLOOKUP(B122,[1]Eproject!$A:$E,5,FALSE)","v":"EOEG Cable Tray Replacement"},{"$f":"VLOOKUP(B122,[1]Eproject!$A:$U,21,FALSE)","v":"972743165"},{"$f":"VLOOKUP(B122,[1]Eproject!$A:$J,10,FALSE)","v":"Hao Yongyong"},{"$f":"VLOOKUP(B122,[1]Eproject!$A:$P,16,FALSE)","v":"2015-05-07"},{"$f":"VLOOKUP(E122,'[1]actual cost'!$F:$G,2,FALSE)","v":{"v":1550000,"d":"1,550,000 "}},{"$f":"VLOOKUP(E122,'[1]actual cost'!$F:$H,3,FALSE)","v":{"v":1638570,"d":"1,638,570 "}},{"$f":"VLOOKUP(E122,'[1]actual cost'!$F:$I,4,FALSE)","v":{"v":1588539.96,"d":"1,588,540 "}},{"v":50030.04000000004,"d":"50,030"},{"v":1638570,"d":"1,638,570 "},{"v":1.0248644903225805,"d":"102.49%"}]
[{"$f":"VLOOKUP(B123,[1]Eproject!$A:$B,2,FALSE)","v":"CAP/E"},14128,{"$f":"VLOOKUP(B123,[1]Eproject!$A:$C,3,FALSE)","v":"MOC"},{"$f":"VLOOKUP(B123,[1]Eproject!$A:$E,5,FALSE)","v":"Change T9668 Waste Water Tank to DMA3 Heavies Tank"},{"$f":"VLOOKUP(B123,[1]Eproject!$A:$U,21,FALSE)","v":"972684047"},{"$f":"VLOOKUP(B123,[1]Eproject!$A:$J,10,FALSE)","v":"Xu Jin"},{"$f":"VLOOKUP(B123,[1]Eproject!$A:$P,16,FALSE)","v":"2014-09-04"},{"$f":"VLOOKUP(E123,'[1]actual cost'!$F:$G,2,FALSE)","v":{"v":400000,"d":"400,000 "}},{"$f":"VLOOKUP(E123,'[1]actual cost'!$F:$H,3,FALSE)","v":{"v":414457.81,"d":"414,458 "}},{"$f":"VLOOKUP(E123,'[1]actual cost'!$F:$I,4,FALSE)","v":{"v":467881,"d":"467,881 "}},0,{"v":467881,"d":"467,881 "},{"v":1.1697025,"d":"116.97%"}]
[{"$f":"VLOOKUP(B124,[1]Eproject!$A:$B,2,FALSE)","v":"CBP/S"},14120,{"$f":"VLOOKUP(B124,[1]Eproject!$A:$C,3,FALSE)","v":"MOC"},{"$f":"VLOOKUP(B124,[1]Eproject!$A:$E,5,FALSE)","v":"Add Silencer for Venting Line of External CO2"},{"$f":"VLOOKUP(B124,[1]Eproject!$A:$U,21,FALSE)","v":"972586402"},{"$f":"VLOOKUP(B124,[1]Eproject!$A:$J,10,FALSE)","v":"Gu Jingfeng"},{"$f":"VLOOKUP(B124,[1]Eproject!$A:$P,16,FALSE)","v":"2015-07-24"},{"$f":"VLOOKUP(E124,'[1]actual cost'!$F:$G,2,FALSE)","v":{"v":82700,"d":"82,700 "}},{"$f":"VLOOKUP(E124,'[1]actual cost'!$F:$H,3,FALSE)","v":{"v":114575.68,"d":"114,576 "}},{"$f":"VLOOKUP(E124,'[1]actual cost'!$F:$I,4,FALSE)","v":{"v":98779.07,"d":"98,779 "}},{"v":15796.609999999986,"d":"15,797"},{"v":114575.68,"d":"114,576 "},{"v":1.1944264812575576,"d":"119.44%"}]
[{"$f":"VLOOKUP(B125,[1]Eproject!$A:$B,2,FALSE)","v":"CBP/C"},14119,{"$f":"VLOOKUP(B125,[1]Eproject!$A:$C,3,FALSE)","v":"MOC"},{"$f":"VLOOKUP(B125,[1]Eproject!$A:$E,5,FALSE)","v":"Add New Pipeline to Transport Liquid LPG from STT1120 to the Furnace"},{"$f":"VLOOKUP(B125,[1]Eproject!$A:$U,21,FALSE)","v":"972722696"},{"$f":"VLOOKUP(B125,[1]Eproject!$A:$J,10,FALSE)","v":"Sun Aihong"},{"$f":"VLOOKUP(B125,[1]Eproject!$A:$P,16,FALSE)","v":"2014-10-20"},{"$f":"VLOOKUP(E125,'[1]actual cost'!$F:$G,2,FALSE)","v":{"v":390000,"d":"390,000 "}},{"$f":"VLOOKUP(E125,'[1]actual cost'!$F:$H,3,FALSE)","v":{"v":622733.89,"d":"622,734 "}},{"$f":"VLOOKUP(E125,'[1]actual cost'!$F:$I,4,FALSE)","v":{"v":643699.29,"d":"643,699 "}},0,{"v":643699.29,"d":"643,699 "},{"v":1.650511,"d":"165.05%"}]
[{"$f":"VLOOKUP(B126,[1]Eproject!$A:$B,2,FALSE)","v":"CBP/A"},14109,{"$f":"VLOOKUP(B126,[1]Eproject!$A:$C,3,FALSE)","v":"MOC"},{"$f":"VLOOKUP(B126,[1]Eproject!$A:$E,5,FALSE)","v":"Add a Steam Trap for 520-E-204"},{"$f":"VLOOKUP(B126,[1]Eproject!$A:$U,21,FALSE)","v":"972670911"},{"$f":"VLOOKUP(B126,[1]Eproject!$A:$J,10,FALSE)","v":"Wang Can"},{"$f":"VLOOKUP(B126,[1]Eproject!$A:$P,16,FALSE)","v":"2015-05-09"},{"$f":"VLOOKUP(E126,'[1]actual cost'!$F:$G,2,FALSE)","v":{"v":162000,"d":"162,000 "}},{"$f":"VLOOKUP(E126,'[1]actual cost'!$F:$H,3,FALSE)","v":{"v":122399.02,"d":"122,399 "}},{"$f":"VLOOKUP(E126,'[1]actual cost'!$F:$I,4,FALSE)","v":{"v":162803.63,"d":"162,804 "}},0,{"v":162803.63,"d":"162,804 "},{"v":1.0049606790123458,"d":"100.50%"}]
[{"$f":"VLOOKUP(B127,[1]Eproject!$A:$B,2,FALSE)","v":"CBP/C"},14073,{"$f":"VLOOKUP(B127,[1]Eproject!$A:$C,3,FALSE)","v":"MOC"},{"$f":"VLOOKUP(B127,[1]Eproject!$A:$E,5,FALSE)","v":"Move Control Valve FV2408 to the Inlet Nozzle of V910"},{"$f":"VLOOKUP(B127,[1]Eproject!$A:$U,21,FALSE)","v":"972702734"},{"$f":"VLOOKUP(B127,[1]Eproject!$A:$J,10,FALSE)","v":"Wang Can"},{"$f":"VLOOKUP(B127,[1]Eproject!$A:$P,16,FALSE)","v":"2015-05-09"},{"$f":"VLOOKUP(E127,'[1]actual cost'!$F:$G,2,FALSE)","v":{"v":147725,"d":"147,725 "}},{"$f":"VLOOKUP(E127,'[1]actual cost'!$F:$H,3,FALSE)","v":{"v":107468.53,"d":"107,469 "}},{"$f":"VLOOKUP(E127,'[1]actual cost'!$F:$I,4,FALSE)","v":{"v":151650.39,"d":"151,650 "}},0,{"v":151650.39,"d":"151,650 "},{"v":1.026572279573532,"d":"102.66%"}]
[{"$f":"VLOOKUP(B128,[1]Eproject!$A:$B,2,FALSE)","v":"CBP/A"},14069,{"$f":"VLOOKUP(B128,[1]Eproject!$A:$C,3,FALSE)","v":"MOC"},{"$f":"VLOOKUP(B128,[1]Eproject!$A:$E,5,FALSE)","v":"Add a Bypass Line from AEU Pit Drum to PGU Off-spec Drum"},{"$f":"VLOOKUP(B128,[1]Eproject!$A:$U,21,FALSE)","v":"972731699"},{"$f":"VLOOKUP(B128,[1]Eproject!$A:$J,10,FALSE)","v":"Chen Chen"},{"$f":"VLOOKUP(B128,[1]Eproject!$A:$P,16,FALSE)","v":"2014-10-17"},{"$f":"VLOOKUP(E128,'[1]actual cost'!$F:$G,2,FALSE)","v":{"v":191000,"d":"191,000 "}},{"$f":"VLOOKUP(E128,'[1]actual cost'!$F:$H,3,FALSE)","v":{"v":220150.19,"d":"220,150 "}},{"$f":"VLOOKUP(E128,'[1]actual cost'!$F:$I,4,FALSE)","v":{"v":268708.9,"d":"268,709 "}},0,{"v":268708.9,"d":"268,709 "},{"v":1.406852879581152,"d":"140.69%"}]
[{"$f":"VLOOKUP(B129,[1]Eproject!$A:$B,2,FALSE)","v":"CBP/M"},14065,{"$f":"VLOOKUP(B129,[1]Eproject!$A:$C,3,FALSE)","v":"MOC"},{"$f":"VLOOKUP(B129,[1]Eproject!$A:$E,5,FALSE)","v":"Replace Butterfly Valves for Cooling Water Tower"},{"$f":"VLOOKUP(B129,[1]Eproject!$A:$U,21,FALSE)","v":"972676906"},{"$f":"VLOOKUP(B129,[1]Eproject!$A:$J,10,FALSE)","v":"Sun Aihong"},{"$f":"VLOOKUP(B129,[1]Eproject!$A:$P,16,FALSE)","v":"2015-04-30"},{"$f":"VLOOKUP(E129,'[1]actual cost'!$F:$G,2,FALSE)","v":{"v":487000,"d":"487,000 "}},{"$f":"VLOOKUP(E129,'[1]actual cost'!$F:$H,3,FALSE)","v":{"v":544005.2,"d":"544,005 "}},{"$f":"VLOOKUP(E129,'[1]actual cost'!$F:$I,4,FALSE)","v":{"v":404481.24,"d":"404,481 "}},{"v":139523.95999999996,"d":"139,524"},{"v":544005.2,"d":"544,005 "},{"v":0.8305569609856263,"d":"83.06%"}]
[{"$f":"VLOOKUP(B130,[1]Eproject!$A:$B,2,FALSE)","v":"CBP/B"},14061,{"$f":"VLOOKUP(B130,[1]Eproject!$A:$C,3,FALSE)","v":"MOC"},{"$f":"VLOOKUP(B130,[1]Eproject!$A:$E,5,FALSE)","v":"Add a Support for E1604"},{"$f":"VLOOKUP(B130,[1]Eproject!$A:$U,21,FALSE)","v":"972631740"},{"$f":"VLOOKUP(B130,[1]Eproject!$A:$J,10,FALSE)","v":"Ding Juntao"},{"$f":"VLOOKUP(B130,[1]Eproject!$A:$P,16,FALSE)","v":"2015-04-25"},{"$f":"VLOOKUP(E130,'[1]actual cost'!$F:$G,2,FALSE)","v":{"v":155550,"d":"155,550 "}},{"$f":"VLOOKUP(E130,'[1]actual cost'!$F:$H,3,FALSE)","v":{"v":82550,"d":"82,550 "}},{"$f":"VLOOKUP(E130,'[1]actual cost'!$F:$I,4,FALSE)","v":{"v":29480.39,"d":"29,480 "}},{"v":53069.61,"d":"53,070"},{"v":82550,"d":"82,550 "},{"v":0.18952356155576985,"d":"18.95%"}]
[{"$f":"VLOOKUP(B131,[1]Eproject!$A:$B,2,FALSE)","v":"CBP/C"},14059,{"$f":"VLOOKUP(B131,[1]Eproject!$A:$C,3,FALSE)","v":"MOC"},{"$f":"VLOOKUP(B131,[1]Eproject!$A:$E,5,FALSE)","v":"Add a Flowmeter on Continuous Blowdown Pipeline of H109"},{"$f":"VLOOKUP(B131,[1]Eproject!$A:$U,21,FALSE)","v":"972651625"},{"$f":"VLOOKUP(B131,[1]Eproject!$A:$J,10,FALSE)","v":"Wang Can"},{"$f":"VLOOKUP(B131,[1]Eproject!$A:$P,16,FALSE)","v":"2015-05-09"},{"$f":"VLOOKUP(E131,'[1]actual cost'!$F:$G,2,FALSE)","v":{"v":190000,"d":"190,000 "}},{"$f":"VLOOKUP(E131,'[1]actual cost'!$F:$H,3,FALSE)","v":{"v":156462.42,"d":"156,462 "}},{"$f":"VLOOKUP(E131,'[1]actual cost'!$F:$I,4,FALSE)","v":{"v":192171.77,"d":"192,172 "}},0,{"v":192171.77,"d":"192,172 "},{"v":1.0114303684210526,"d":"101.14%"}]
[{"$f":"VLOOKUP(B132,[1]Eproject!$A:$B,2,FALSE)","v":"CTS/P"},14044,{"$f":"VLOOKUP(B132,[1]Eproject!$A:$C,3,FALSE)","v":"MOC"},{"$f":"VLOOKUP(B132,[1]Eproject!$A:$E,5,FALSE)","v":"Modify Filter ST6503"},{"$f":"VLOOKUP(B132,[1]Eproject!$A:$U,21,FALSE)","v":"972785185"},{"$f":"VLOOKUP(B132,[1]Eproject!$A:$J,10,FALSE)","v":"Chen Yangwei"},{"$f":"VLOOKUP(B132,[1]Eproject!$A:$P,16,FALSE)","v":"2015-05-06"},{"$f":"VLOOKUP(E132,'[1]actual cost'!$F:$G,2,FALSE)","v":{"v":239925,"d":"239,925 "}},{"$f":"VLOOKUP(E132,'[1]actual cost'!$F:$H,3,FALSE)","v":{"v":141419.23,"d":"141,419 "}},{"$f":"VLOOKUP(E132,'[1]actual cost'!$F:$I,4,FALSE)","v":{"v":412800.67,"d":"412,801 "}},{"$f":"IF(J132>I132,0,I132-J132)","v":0},{"$f":"J132+K132","v":{"v":412800.67,"d":"412,801 "}},{"$f":"J132/H132","v":{"v":1.7205404605605918,"d":"172.05%"}}]
[{"$f":"VLOOKUP(B133,[1]Eproject!$A:$B,2,FALSE)","v":"CBP/M"},14040,{"$f":"VLOOKUP(B133,[1]Eproject!$A:$C,3,FALSE)","v":"MOC"},{"$f":"VLOOKUP(B133,[1]Eproject!$A:$E,5,FALSE)","v":"Modify Discharge Temperature Interlock System of H2301"},{"$f":"VLOOKUP(B133,[1]Eproject!$A:$U,21,FALSE)","v":"972732621"},{"$f":"VLOOKUP(B133,[1]Eproject!$A:$J,10,FALSE)","v":"Gong Feibao"},{"$f":"VLOOKUP(B133,[1]Eproject!$A:$P,16,FALSE)","v":"2015-04-29"},{"$f":"VLOOKUP(E133,'[1]actual cost'!$F:$G,2,FALSE)","v":{"v":405000,"d":"405,000 "}},{"$f":"VLOOKUP(E133,'[1]actual cost'!$F:$H,3,FALSE)","v":{"v":218063.51,"d":"218,064 "}},{"$f":"VLOOKUP(E133,'[1]actual cost'!$F:$I,4,FALSE)","v":{"v":187376.92,"d":"187,377 "}},{"v":30686.589999999997,"d":"30,687"},{"v":218063.51,"d":"218,064 "},{"v":0.4626590617283951,"d":"46.27%"}]
[{"$f":"VLOOKUP(B134,[1]Eproject!$A:$B,2,FALSE)","v":"CBP/M"},14036,{"$f":"VLOOKUP(B134,[1]Eproject!$A:$C,3,FALSE)","v":"MOC"},{"$f":"VLOOKUP(B134,[1]Eproject!$A:$E,5,FALSE)","v":"Adding Two Flammable Gas Detectors in CWR Pipe"},{"$f":"VLOOKUP(B134,[1]Eproject!$A:$U,21,FALSE)","v":"972937929"},{"$f":"VLOOKUP(B134,[1]Eproject!$A:$J,10,FALSE)","v":"Gong Feibao"},{"$f":"VLOOKUP(B134,[1]Eproject!$A:$P,16,FALSE)","v":"2015-11-04"},{"$f":"VLOOKUP(E134,'[1]actual cost'!$F:$G,2,FALSE)","v":{"v":291000,"d":"291,000 "}},{"$f":"VLOOKUP(E134,'[1]actual cost'!$F:$H,3,FALSE)","v":{"v":259140.85,"d":"259,141 "}},{"$f":"VLOOKUP(E134,'[1]actual cost'!$F:$I,4,FALSE)","v":{"v":282094.63,"d":"282,095 "}},0,{"v":282094.63,"d":"282,095 "},{"v":0.9693973539518901,"d":"96.94%"}]
[{"$f":"VLOOKUP(B135,[1]Eproject!$A:$B,2,FALSE)","v":"CBP/C"},14028,{"$f":"VLOOKUP(B135,[1]Eproject!$A:$C,3,FALSE)","v":"MOC"},{"$f":"VLOOKUP(B135,[1]Eproject!$A:$E,5,FALSE)","v":"Modification of Flare Obstacle Lighting and Ignition System for EU"},{"$f":"VLOOKUP(B135,[1]Eproject!$A:$U,21,FALSE)","v":"972802859"},{"$f":"VLOOKUP(B135,[1]Eproject!$A:$J,10,FALSE)","v":"Tong Shaojian"},{"$f":"VLOOKUP(B135,[1]Eproject!$A:$P,16,FALSE)","v":"00:00:00"},{"$f":"VLOOKUP(E135,'[1]actual cost'!$F:$G,2,FALSE)","v":{"v":2500000,"d":"2,500,000 "}},{"$f":"VLOOKUP(E135,'[1]actual cost'!$F:$H,3,FALSE)","v":{"v":193191.23,"d":"193,191 "}},{"$f":"VLOOKUP(E135,'[1]actual cost'!$F:$I,4,FALSE)","v":{"v":2453339.54,"d":"2,453,340 "}},0,{"v":2453339.54,"d":"2,453,340 "},{"v":0.981335816,"d":"98.13%"}]
[{"$f":"VLOOKUP(B136,[1]Eproject!$A:$B,2,FALSE)","v":"CBP/C"},14024,{"$f":"VLOOKUP(B136,[1]Eproject!$A:$C,3,FALSE)","v":"MOC"},{"$f":"VLOOKUP(B136,[1]Eproject!$A:$E,5,FALSE)","v":"Change Temporary Tie to Permanent Type for the Lines from Wison and E930"},{"$f":"VLOOKUP(B136,[1]Eproject!$A:$U,21,FALSE)","v":"972319739"},{"$f":"VLOOKUP(B136,[1]Eproject!$A:$J,10,FALSE)","v":"Qiu Zhufeng"},{"$f":"VLOOKUP(B136,[1]Eproject!$A:$P,16,FALSE)","v":"2015-05-09"},{"$f":"VLOOKUP(E136,'[1]actual cost'!$F:$G,2,FALSE)","v":{"v":135000,"d":"135,000 "}},{"$f":"VLOOKUP(E136,'[1]actual cost'!$F:$H,3,FALSE)","v":{"v":68675,"d":"68,675 "}},{"$f":"VLOOKUP(E136,'[1]actual cost'!$F:$I,4,FALSE)","v":{"v":79377.44,"d":"79,377 "}},0,{"v":79377.44,"d":"79,377 "},{"v":0.5879810370370371,"d":"58.80%"}]
[{"$f":"VLOOKUP(B137,[1]Eproject!$A:$B,2,FALSE)","v":"CBP/C"},14022,{"$f":"VLOOKUP(B137,[1]Eproject!$A:$C,3,FALSE)","v":"MOC"},{"$f":"VLOOKUP(B137,[1]Eproject!$A:$E,5,FALSE)","v":"Add a Pipeline from Seal Oil Drainer to 330-V-310"},{"$f":"VLOOKUP(B137,[1]Eproject!$A:$U,21,FALSE)","v":"972320940"},{"$f":"VLOOKUP(B137,[1]Eproject!$A:$J,10,FALSE)","v":"Qiu Zhufeng"},{"$f":"VLOOKUP(B137,[1]Eproject!$A:$P,16,FALSE)","v":"2015-05-09"},{"$f":"VLOOKUP(E137,'[1]actual cost'!$F:$G,2,FALSE)","v":{"v":139000,"d":"139,000 "}},{"$f":"VLOOKUP(E137,'[1]actual cost'!$F:$H,3,FALSE)","v":{"v":71475,"d":"71,475 "}},{"$f":"VLOOKUP(E137,'[1]actual cost'!$F:$I,4,FALSE)","v":{"v":67617.86,"d":"67,618 "}},{"v":3857.1399999999994,"d":"3,857"},{"v":71475,"d":"71,475 "},{"v":0.48645942446043167,"d":"48.65%"}]
[{"$f":"VLOOKUP(B138,[1]Eproject!$A:$B,2,FALSE)","v":"CBP/B"},14020,{"$f":"VLOOKUP(B138,[1]Eproject!$A:$C,3,FALSE)","v":"MOC"},{"$f":"VLOOKUP(B138,[1]Eproject!$A:$E,5,FALSE)","v":"Add Silencer in Steam Venting Line of V514"},{"$f":"VLOOKUP(B138,[1]Eproject!$A:$U,21,FALSE)","v":"972377375"},{"$f":"VLOOKUP(B138,[1]Eproject!$A:$J,10,FALSE)","v":"Chen Chen"},{"$f":"VLOOKUP(B138,[1]Eproject!$A:$P,16,FALSE)","v":"2015-04-25"},{"$f":"VLOOKUP(E138,'[1]actual cost'!$F:$G,2,FALSE)","v":{"v":121000,"d":"121,000 "}},{"$f":"VLOOKUP(E138,'[1]actual cost'!$F:$H,3,FALSE)","v":{"v":119277.7,"d":"119,278 "}},{"$f":"VLOOKUP(E138,'[1]actual cost'!$F:$I,4,FALSE)","v":{"v":144464.16,"d":"144,464 "}},0,{"v":144464.16,"d":"144,464 "},{"v":1.1939186776859505,"d":"119.39%"}]
[{"$f":"VLOOKUP(B139,[1]Eproject!$A:$B,2,FALSE)","v":"CBP/B"},14017,{"$f":"VLOOKUP(B139,[1]Eproject!$A:$C,3,FALSE)","v":"MOC"},{"$f":"VLOOKUP(B139,[1]Eproject!$A:$E,5,FALSE)","v":"Add a Basket Filter on Outlet Line of P404A/B"},{"$f":"VLOOKUP(B139,[1]Eproject!$A:$U,21,FALSE)","v":"972576812"},{"$f":"VLOOKUP(B139,[1]Eproject!$A:$J,10,FALSE)","v":"Wang Can"},{"$f":"VLOOKUP(B139,[1]Eproject!$A:$P,16,FALSE)","v":"2015-05-04"},{"$f":"VLOOKUP(E139,'[1]actual cost'!$F:$G,2,FALSE)","v":{"v":176000,"d":"176,000 "}},{"$f":"VLOOKUP(E139,'[1]actual cost'!$F:$H,3,FALSE)","v":{"v":99660.28,"d":"99,660 "}},{"$f":"VLOOKUP(E139,'[1]actual cost'!$F:$I,4,FALSE)","v":{"v":150682.12,"d":"150,682 "}},0,{"v":150682.12,"d":"150,682 "},{"v":0.8561484090909091,"d":"85.61%"}]
[{"$f":"VLOOKUP(B140,[1]Eproject!$A:$B,2,FALSE)","v":"CBP/C"},13246,{"$f":"VLOOKUP(B140,[1]Eproject!$A:$C,3,FALSE)","v":"MOC"},{"$f":"VLOOKUP(B140,[1]Eproject!$A:$E,5,FALSE)","v":"Add Filters for IA Header"},{"$f":"VLOOKUP(B140,[1]Eproject!$A:$U,21,FALSE)","v":"971989443"},{"$f":"VLOOKUP(B140,[1]Eproject!$A:$J,10,FALSE)","v":"Wang Can"},{"$f":"VLOOKUP(B140,[1]Eproject!$A:$P,16,FALSE)","v":"2015-05-04"},{"$f":"VLOOKUP(E140,'[1]actual cost'!$F:$G,2,FALSE)","v":{"v":271000,"d":"271,000 "}},{"$f":"VLOOKUP(E140,'[1]actual cost'!$F:$H,3,FALSE)","v":{"v":196036.96,"d":"196,037 "}},{"$f":"VLOOKUP(E140,'[1]actual cost'!$F:$I,4,FALSE)","v":{"v":297744.28,"d":"297,744 "}},0,{"v":297744.28,"d":"297,744 "},{"v":1.0986873800738008,"d":"109.87%"}]
[{"$f":"VLOOKUP(B141,[1]Eproject!$A:$B,2,FALSE)","v":"COA/A"},13216,{"$f":"VLOOKUP(B141,[1]Eproject!$A:$C,3,FALSE)","v":"MOC"},{"$f":"VLOOKUP(B141,[1]Eproject!$A:$E,5,FALSE)","v":"Install the Deep Pipes in CAA Tanks for Restab System"},{"$f":"VLOOKUP(B141,[1]Eproject!$A:$U,21,FALSE)","v":"971848268"},{"$f":"VLOOKUP(B141,[1]Eproject!$A:$J,10,FALSE)","v":"Li Xingming"},{"$f":"VLOOKUP(B141,[1]Eproject!$A:$P,16,FALSE)","v":"00:00:00"},{"$f":"VLOOKUP(E141,'[1]actual cost'!$F:$G,2,FALSE)","v":{"v":26400,"d":"26,400 "}},{"$f":"VLOOKUP(E141,'[1]actual cost'!$F:$H,3,FALSE)","v":{"v":26400,"d":"26,400 "}},{"$f":"VLOOKUP(E141,'[1]actual cost'!$F:$I,4,FALSE)","v":{"v":27500,"d":"27,500 "}},0,{"v":27500,"d":"27,500 "},{"v":1.0416666666666667,"d":"104.17%"}]
[{"$f":"VLOOKUP(B142,[1]Eproject!$A:$B,2,FALSE)","v":"CBP/B"},13052,{"$f":"VLOOKUP(B142,[1]Eproject!$A:$C,3,FALSE)","v":"MOC"},{"$f":"VLOOKUP(B142,[1]Eproject!$A:$E,5,FALSE)","v":"Add One Pipeline from C1200 to EU C220 for Recycling Offgas"},{"$f":"VLOOKUP(B142,[1]Eproject!$A:$U,21,FALSE)","v":"971877174"},{"$f":"VLOOKUP(B142,[1]Eproject!$A:$J,10,FALSE)","v":"Sun Aihong"},{"$f":"VLOOKUP(B142,[1]Eproject!$A:$P,16,FALSE)","v":"2014-05-30"},{"$f":"VLOOKUP(E142,'[1]actual cost'!$F:$G,2,FALSE)","v":{"v":437100,"d":"437,100 "}},{"$f":"VLOOKUP(E142,'[1]actual cost'!$F:$H,3,FALSE)","v":{"v":491174.08,"d":"491,174 "}},{"$f":"VLOOKUP(E142,'[1]actual cost'!$F:$I,4,FALSE)","v":{"v":528057.2,"d":"528,057 "}},0,{"v":528057.2,"d":"528,057 "},{"v":1.2080924273621596,"d":"120.81%"}]